program: Gaussian 09
title: 000227416
version: EM64L-G09RevD.01
frameworkgroup: C1[X(C10H19NO)]
method: RPBEPBE
basis: SDD
operation: Freq
keyword: #p
keyword: freq=noraman
keyword: PBEPBE/SDD
title: #p freq=noraman PBEPBE/SDD
converged: NO YES NO NO
title: Mulliken charges:
elementType: O N C C C C C C C C C C H H H H H H H H H H H H H H H H H H H
charge: -0.263112 -0.617303 -0.030556 -0.430933 -0.417971 -0.379904 -0.427552 -0.422929 -0.386308 -0.365373 -0.564689 0.218329 0.242646 0.188335 0.205786 0.198614 0.219324 0.191556 0.197374 0.198924 0.186932 0.193593 0.198719 0.199029 0.194325 0.194389 0.190979 0.236032 0.209529 0.311284 0.330932
chargesum: 0.00000
title: Mulliken charges with hydrogens summed into heavy atoms:
elementType: O N C C C C C C C C C C
charge: -0.263112 0.024913 0.212090 -0.036812 -0.000033 0.009026 -0.041696 -0.030618 0.007046 0.019995 -0.119128 0.218329
polarizability: 1.29536977e+02 -5.60151767e+00 1.11524929e+02 -1.63782903e+00 -4.53455728e+00 9.78404513e+01
1716.lowfreq: -16.9826 0.0006 0.0007 0.0008 8.2639 16.4030 25.2300 43.6916 76.0223
frequency: 24.6924 41.8534 75.4567 134.5832 193.5172 200.9070 234.2356 249.1178 271.3406 334.9841 351.5621 379.4702 423.8457 462.5465 472.7955 496.3193 523.4835 566.0114 594.2529 665.3094 703.2956 757.3771 775.0477 782.7244 839.5946 855.7465 870.7852 891.7132 918.4586 960.8746 982.4325 1005.4839 1014.4134 1045.8104 1059.1083 1102.3578 1111.1708 1116.6485 1130.3336 1148.6155 1168.5563 1202.3872 1222.8051 1231.3945 1256.1471 1257.6191 1269.5929 1287.6057 1299.1823 1330.0347 1337.2974 1339.9179 1343.9387 1347.0844 1361.3245 1364.4525 1368.4581 1379.3403 1446.3043 1461.2597 1464.7074 1465.7610 1470.1094 1473.4252 1489.9446 1497.9886 1593.0699 1639.7200 2949.4588 2955.3743 2959.9639 2965.3613 2969.6172 2971.2810 2974.9116 2977.9923 2987.2386 2999.4929 3005.7703 3014.9446 3017.7028 3024.2191 3029.2913 3032.7477 3037.6717 3514.5595 3672.6665
redmass: 4.4904 4.0799 3.2041 3.8591 2.4561 2.4005 2.7176 2.5480 2.1315 3.1708 2.3285 2.0523 1.9053 2.0769 1.6038 1.2953 1.9673 2.1434 1.8516 1.9415 2.1194 1.7884 1.9618 2.1975 2.4266 1.8775 1.8364 1.9776 2.0260 1.8961 2.0480 1.9810 2.1760 1.6985 2.1742 2.0043 1.8338 1.9081 1.3863 2.3175 1.2676 1.2590 1.3010 1.2437 1.2235 1.2301 1.2125 1.1289 1.5287 1.4097 1.4095 1.4219 1.4816 1.4207 1.7744 1.4261 1.6090 1.3706 1.1105 1.0830 1.0827 1.0859 1.0888 1.0830 1.0820 1.0785 1.4521 3.4595 1.0603 1.0600 1.0616 1.0626 1.0718 1.0642 1.0654 1.0655 1.0702 1.0972 1.0962 1.0991 1.1001 1.1008 1.0987 1.0999 1.0984 1.0446 1.1042
irintensity: 12.7766 2.6118 0.5145 6.9236 0.0538 1.4681 0.1348 1.2643 0.8147 1.3334 0.2191 1.7822 0.6752 5.1512 1.0487 120.5413 90.9104 0.7682 48.0991 54.5684 1.6107 1.3591 9.7049 3.2113 2.0379 5.0198 1.9182 1.8456 1.1749 1.5613 2.1504 3.3472 3.6388 1.1656 4.0393 1.3775 1.1625 0.5789 0.4709 4.1650 5.6964 7.1603 23.5048 0.8487 2.0799 1.2955 0.4343 7.0038 36.5378 4.6223 1.8134 0.1035 7.4039 2.0006 53.8078 9.2884 35.5080 4.8933 13.7540 2.4308 11.7221 9.6491 3.1449 9.1621 3.3095 38.3546 65.8846 262.1047 35.3110 19.7878 23.0584 28.8564 22.4563 29.8335 18.6134 23.4557 17.0860 40.6416 49.7380 54.2093 57.0703 100.9241 37.3755 55.2260 107.2720 25.7524 19.3888
temp: 298.150 k
press: 1.00000 atm
elementType: 8 7 6 6 6 6 6 6 6 6 6 6 1 1 1 1 1 1 1 1 1 1 1 1 1 1 1 1 1 1 1
symmnumber: 1
zpe: 730906.2 jmol-1
zpe.correction: 0.278387 hartree
zpe.thermalcorrener: 0.291014 hartree
zpe.thermalcorrenthalpy: 0.291958 hartree
zpe.thermalcorrgfe: 0.238846 hartree
zpe.sumelectzpe: -521.470627 hartree
zpe.sumelectthermal: -521.458000 hartree
zpe.sumelectthermalent: -521.457056 hartree
zpe.sumelectthermalfe: -521.510168 hartree
dipole: 0.8487 2.4203 -2.7807
dipole: 3.7830
quadrupole: -76.0310 -73.8842 -75.7241
quadrupole: -10.8308 9.5656 0.4363
quadrupole: -0.8179 1.3289 -0.5110 -10.8308 9.5656 0.4363
hfenergy: -521.7490142 hartree
pointgroup: C01 [X(C10H19N1O1)]
dipole: -0.3376593 0.8838584 1.1488733 debye
polarizability: 129.7646525|5.2687634|110.6718141|-0.6404041|5.5067408|98.4658901 unknown
InChI: InChI=1S/C10H19NO/c11-10(12)8-9-6-4-2-1-3-5-7-9/h9H,1-8,11H2
charge 0 multiplicity 1
31 atoms
O  3.276989 -0.833328 -0.888753
N  3.582536 0.794021 0.731558
C  0.370209 -0.799996 -0.187431
C  -0.821529 -1.500453 0.532089
C  0.025255 0.494519 -0.974133
C  -2.15546 -1.576858 -0.266876
C  -0.445577 1.739104 -0.183141
C  -3.234892 -0.53156 0.123923
C  -1.770955 1.602145 0.6161
C  -2.951529 0.965272 -0.175098
C  1.527328 -0.582623 0.825731
C  2.85264 -0.228411 0.140602
H  0.759072 -1.510968 -0.945892
H  -1.016513 -1.015952 1.50967
H  -0.48674 -2.530013 0.774132
H  -0.743014 0.244211 -1.730868
H  0.925278 0.778275 -1.556603
H  -2.605602 -2.576973 -0.105216
H  -1.949917 -1.515696 -1.354663
H  -0.572454 2.560788 -0.918398
H  0.3565 2.078265 0.505006
H  -3.439627 -0.636018 1.210705
H  -4.177619 -0.807832 -0.392844
H  -2.061794 2.618405 0.950017
H  -1.599915 1.02098 1.542583
H  -2.787261 1.102377 -1.263569
H  -3.880665 1.522299 0.060053
H  1.693343 -1.528783 1.380025
H  1.249123 0.183273 1.575415
H  3.244961 1.296426 1.550198
H  4.485127 1.045601 0.328079
