program: Gaussian 09
title: 000227414
version: EM64L-G09RevD.01
frameworkgroup: C1[X(C10H18O3)]
method: RPBEPBE
basis: SDD
operation: Freq
keyword: #pfreq=noraman
keyword: PBEPBE/SDD
title: #p freq=noraman PBEPBE/SDD
converged: YES YES NO NO
title: Mulliken charges:
elementType: O O O C C C C C C C C C C H H H H H H H H H H H H H H H H H H
charge: -0.264437 -0.451311 -0.254076 -0.069143 -0.493200 -0.463158 -0.428319 -0.434668 -0.190505 -0.402620 0.251255 -0.224134 -0.675515 0.233552 0.204928 0.221587 0.226464 0.206680 0.207168 0.218695 0.216894 0.206800 0.256369 0.216834 0.214683 0.346253 0.230754 0.222539 0.208927 0.227094 0.233608
chargesum: 0.00000
title: Mulliken charges with hydrogens summed into heavy atoms:
elementType: O O O C C C C C C C C C C
charge: -0.264437 -0.105057 -0.254076 0.164409 -0.066685 -0.030013 -0.002457 -0.010975 0.065864 0.028898 0.251255 0.229159 -0.005887
polarizability: 1.33720302e+02 -2.91001452e+00 1.16931678e+02 -3.40897446e-01 2.66351898e+00 9.63007038e+01
1716.lowfreq: -0.2225 -0.0009 -0.0009 -0.0007 5.6262 14.5663 33.2474 42.7837 60.2119
frequency: 33.2221 42.1560 60.1432 70.5463 87.3787 88.7174 116.8112 153.0141 157.3077 189.9068 220.2097 256.4340 279.9400 280.4614 331.4938 356.7338 424.8113 458.5138 575.2451 619.7788 680.8563 713.1315 773.3235 800.3234 808.4138 811.8160 864.3798 876.2361 899.6035 949.0675 959.3396 974.9389 981.0361 1015.7491 1034.9392 1039.4621 1064.8754 1095.8266 1108.2889 1112.7597 1124.1374 1135.8328 1151.0747 1180.1001 1197.9933 1214.3796 1224.8378 1235.0423 1248.0770 1256.5512 1276.5625 1296.0475 1301.7585 1306.3354 1310.3152 1335.6413 1342.3620 1364.0334 1398.1844 1401.4022 1462.6910 1463.6259 1469.6358 1473.7954 1474.1675 1474.9403 1487.4301 1492.1568 1630.8332 2961.2687 2966.9937 2979.0745 2990.0268 2995.1627 2995.2036 3009.0552 3011.8772 3017.6292 3039.9635 3042.2260 3054.9917 3059.5860 3067.1617 3079.2142 3091.7736 3106.7540 3579.5578
redmass: 3.9961 1.7185 2.3653 3.2161 3.2063 3.5981 3.8202 2.9716 2.3195 2.1218 1.2898 1.4582 3.3162 3.8287 4.7355 3.5641 2.3135 3.5775 3.1060 2.7238 3.8126 3.6746 1.3674 1.1097 3.2592 1.5569 3.7376 3.5564 2.4941 2.2853 1.9940 1.4207 2.8650 2.2048 1.8181 2.5890 2.7174 2.3380 2.8798 2.3342 2.6549 1.4713 1.4017 1.4401 1.3324 1.2150 1.2159 1.2742 1.1420 1.3386 1.2895 1.2026 1.3106 1.3750 1.2626 1.4364 1.5288 1.5553 1.3919 1.2737 1.0519 1.0698 1.0797 1.0833 1.0823 1.0629 1.0681 1.0990 9.3707 1.0574 1.0790 1.0629 1.0619 1.0394 1.0582 1.0583 1.0663 1.1021 1.0991 1.0902 1.0997 1.1032 1.1064 1.1047 1.0986 1.1024 1.0667
irintensity: 2.0589 0.0522 0.0273 1.3385 0.3285 1.6430 3.8621 6.8806 5.1984 14.6245 135.4308 0.3601 3.8442 2.9898 8.2658 6.0032 0.7578 21.9497 12.9541 1.3244 4.1275 1.5653 4.7093 4.0785 5.5279 0.8545 7.9159 5.3197 3.6890 17.3019 15.5004 0.7514 40.3518 18.9576 6.1634 80.6707 7.2249 13.4818 8.7159 23.8560 224.5110 8.8269 28.2813 2.7965 0.6642 32.3908 13.9576 5.7360 1.3714 42.2347 4.2030 4.2162 1.5589 5.2333 1.7169 35.2583 11.9767 15.1066 3.0042 18.4969 11.6720 2.8572 9.2904 4.6779 11.8443 4.6641 13.1683 2.4653 157.7244 42.5893 13.9680 27.8760 46.5999 10.8121 51.9733 20.9777 56.2216 19.1577 31.3535 23.1264 8.5027 17.0564 8.2888 105.0212 33.1495 43.4036 3.6546
temp: 298.150 k
press: 1.00000 atm
elementType: 8 8 8 6 6 6 6 6 6 6 6 6 6 1 1 1 1 1 1 1 1 1 1 1 1 1 1 1 1 1 1
symmnumber: 1
zpe: 700680.6 jmol-1
zpe.correction: 0.266875 hartree
zpe.thermalcorrener: 0.282006 hartree
zpe.thermalcorrenthalpy: 0.282950 hartree
zpe.thermalcorrgfe: 0.223029 hartree
zpe.sumelectzpe: -616.473611 hartree
zpe.sumelectthermal: -616.458480 hartree
zpe.sumelectthermalent: -616.457536 hartree
zpe.sumelectthermalfe: -616.517457 hartree
dipole: -0.9591 -0.1276 -0.4354
dipole: 1.0610
quadrupole: -72.2959 -69.4264 -85.8826
quadrupole: -5.2457 -0.7296 1.2215
quadrupole: 3.5724 6.4419 -10.0143 -5.2457 -0.7296 1.2215
hfenergy: -616.740486 hartree
pointgroup: C01 [X(C10H18O3)]
dipole: 0.3776971 -0.0353938 0.1741738 debye
polarizability: 133.5834638|3.2855454|116.8480242|-0.2561787|-3.4098972|96.5211953 unknown
InChI: InChI=1S/C10H18O3/c1-2-13-10(12)9(7-11)8-5-3-4-6-8/h8-9,11H,2-7H2,1H3
charge 0 multiplicity 1
31 atoms
O  -1.887163 -0.454467 0.388311
O  -0.976353 3.004648 0.555155
O  -1.389316 0.49535 -1.67859
C  1.391205 0.111999 -0.223585
C  2.696868 0.536962 0.503919
C  1.335972 -1.41423 0.054784
C  3.69163 -0.638218 0.26026
C  2.809045 -1.888136 -0.08447
C  0.120846 0.881388 0.241383
C  0.213145 2.385345 -0.057133
C  -1.109729 0.32139 -0.468047
C  -3.119102 -1.057405 -0.208793
C  -3.802186 -1.850275 0.900648
H  1.514133 0.267971 -1.316328
H  2.485497 0.64733 1.58656
H  3.101262 1.501049 0.146706
H  0.651147 -1.948681 -0.627634
H  0.968159 -1.580838 1.086589
H  4.327717 -0.813691 1.146227
H  4.370076 -0.402296 -0.57986
H  3.007031 -2.221968 -1.119838
H  3.025636 -2.745997 0.576831
H  -0.011675 0.741158 1.329886
H  1.137457 2.803911 0.388449
H  0.225608 2.540166 -1.155912
H  -1.087011 3.924271 0.207849
H  -3.750023 -0.236438 -0.594689
H  -2.819516 -1.690943 -1.063626
H  -4.728706 -2.313861 0.515152
H  -3.142885 -2.651327 1.276991
H  -4.06717 -1.192765 1.746106
