program: Gaussian 09
title: 000227389
version: EM64L-G09RevD.01
frameworkgroup: C1[X(C18H18)]
method: RPBEPBE
basis: SDD
operation: Freq
keyword: #p
keyword: freq=noraman
keyword: PBEPBE/SDD
title: #p freq=noraman PBEPBE/SDD
converged: YES YES NO NO
title: Mulliken charges:
elementType: C C C C C C C C C C C C C C C C C C H H H H H H H H H H H H H H H H H H
charge: -0.428243 -0.521031 -0.409422 0.308295 -0.440725 -0.367258 0.332565 -0.393761 -0.403024 0.360941 -0.415218 -0.418867 0.336178 -0.397350 -0.398117 -0.237464 -0.237059 -0.243932 0.204648 0.204792 0.209167 0.226843 0.208196 0.203330 0.210617 0.214555 0.210235 0.224120 0.238349 0.233711 0.234049 0.237515 0.236563 0.224153 0.224163 0.228484
chargesum: 0.00000
title: Mulliken charges with hydrogens summed into heavy atoms:
elementType: C C C C C C C C C C C C C C C C C C
charge: -0.018803 -0.085022 0.002104 0.308295 -0.015553 -0.157022 0.332565 -0.169640 -0.164674 0.360941 -0.181507 -0.184818 0.336178 -0.159834 -0.161554 -0.013310 -0.012896 -0.015449
polarizability: 3.58219723e+02 -1.27201936e+01 1.73036565e+02 5.49168761e+00 8.38966466e+00 1.07367763e+02
1716.lowfreq: -20.5447 -6.9509 -4.8103 0.0001 0.0007 0.0008 29.3569 34.4238 68.4162
frequency: 28.0928 34.3815 68.4136 77.6307 101.8705 139.5085 174.6173 205.4685 234.1582 268.8547 316.4248 382.3344 389.1694 400.6134 404.3040 408.8432 456.8680 493.3560 516.7404 529.9045 564.6337 614.0918 634.1620 638.9579 700.3739 715.9314 734.3587 763.4898 770.8664 802.9137 828.7233 838.8317 846.8502 849.0284 862.5831 916.6846 920.3217 926.8359 933.9903 960.6396 968.5032 971.9703 987.4223 992.0034 992.5482 996.8998 1020.8698 1042.2543 1077.2175 1079.1052 1083.3846 1104.8442 1128.8123 1132.8383 1171.8281 1172.5622 1191.5148 1210.3240 1240.7047 1247.0900 1276.3512 1293.9682 1304.3926 1309.7553 1315.5320 1337.2333 1338.7847 1340.6212 1350.7074 1371.6073 1374.2935 1419.0997 1436.9907 1452.9613 1458.7402 1470.3586 1476.3855 1477.6475 1518.8089 1554.4189 1585.6130 1611.2843 1619.2013 1654.0271 2942.5601 2950.1407 2977.7883 2978.0744 3002.8614 3013.0027 3037.6974 3047.1006 3101.6922 3121.1493 3123.0862 3125.9093 3127.9035 3139.3061 3146.2977 3148.5678 3153.9211 3164.2066
redmass: 3.3103 4.3939 3.9232 3.8737 3.4062 3.6436 2.6492 5.5362 3.1147 2.7788 2.2360 4.7210 3.5970 3.6453 2.8753 2.9073 2.5465 3.3679 3.3076 3.6998 2.2854 6.4656 4.5870 6.5961 1.7269 2.9890 2.9895 3.7091 1.9696 1.3456 1.5538 1.3895 1.6544 1.6974 1.6499 1.4522 1.4191 2.5914 2.5591 1.3959 1.4016 1.4193 5.2442 1.3140 4.9497 3.9787 2.5852 1.8894 1.8391 1.7409 1.6219 1.4883 1.3561 1.2143 1.4946 1.0682 1.1152 1.1216 1.2983 1.9134 1.5222 2.8022 1.4625 1.2935 1.3753 1.4318 1.6475 1.8225 1.8059 2.2176 6.5256 3.7949 2.3864 1.1038 1.0862 1.0964 1.1139 2.0422 2.7921 5.8394 6.2627 6.0175 6.2120 6.5774 1.0656 1.0641 1.0640 1.0643 1.0898 1.0935 1.0989 1.1041 1.0898 1.0845 1.0870 1.0868 1.0868 1.0919 1.0955 1.0958 1.0959 1.1016
irintensity: 0.0990 0.2868 0.1188 0.1147 0.1327 0.1812 1.3111 0.0303 1.6654 0.5268 0.7647 0.8159 2.0367 3.7545 0.4121 0.1169 2.0693 5.5671 8.0741 3.4038 2.6167 0.0088 1.3846 0.2458 46.8796 6.9299 14.2602 13.0825 71.2571 15.4444 29.4271 16.6753 0.4943 2.4973 8.0650 0.9275 4.4179 2.8496 4.2580 0.0856 0.2358 0.2936 0.1519 0.0569 11.0169 0.8530 2.6045 3.7396 0.4377 4.5343 8.1848 3.9788 7.4637 6.4507 1.2250 0.1117 0.8593 0.7445 3.5816 1.4195 3.1962 1.8584 5.5810 1.3011 2.2861 1.8587 3.3686 8.6059 2.1278 8.1303 1.4038 5.0500 3.7594 2.7432 19.2500 10.1979 3.1897 60.0066 10.7331 1.0094 2.0791 24.6646 1.2983 12.1106 45.8062 26.9535 25.4724 40.3548 63.6129 26.0586 79.3907 68.1882 26.8602 15.0524 0.5333 17.5681 4.3971 11.3199 7.9344 64.5056 6.2631 30.8003
temp: 298.150 k
press: 1.00000 atm
elementType: 6 6 6 6 6 6 6 6 6 6 6 6 6 6 6 6 6 6 1 1 1 1 1 1 1 1 1 1 1 1 1 1 1 1 1 1
symmnumber: 1
zpe: 795029.6 jmol-1
zpe.correction: 0.302811 hartree
zpe.thermalcorrener: 0.317828 hartree
zpe.thermalcorrenthalpy: 0.318773 hartree
zpe.thermalcorrgfe: 0.259416 hartree
zpe.sumelectzpe: -695.446448 hartree
zpe.sumelectthermal: -695.431431 hartree
zpe.sumelectthermalent: -695.430486 hartree
zpe.sumelectthermalfe: -695.489843 hartree
dipole: -1.0449 -0.0765 0.0392
dipole: 1.0484
quadrupole: -91.7399 -97.5175 -111.3794
quadrupole: -0.0413 0.0392 2.7477
quadrupole: 8.4724 2.6948 -11.1672 -0.0413 0.0392 2.7477
hfenergy: -695.7492591 hartree
pointgroup: C01 [X(C18H18)]
dipole: -0.4110225 0.0322373 0.0123494 debye
polarizability: 358.2632814|11.9384333|127.0801998|6.2711274|31.2646808|153.2805695 unknown
InChI: InChI=1S/C18H18/c1-3-7-15(8-4-1)17-11-13-18(14-12-17)16-9-5-2-6-10-16/h1,3-4,7-9,11-14H,2,5-6,10H2
charge 0 multiplicity 1
36 atoms
C  -5.130779 1.261607 0.147523
C  -3.636919 1.192899 0.538057
C  -5.816555 -0.10569 0.355065
C  -2.921731 -0.022975 -0.055306
C  -5.154195 -1.174434 -0.54426
C  -3.640433 -1.083523 -0.53794
C  -1.429585 -0.016162 -0.06001
C  -0.667587 -0.824666 -0.953363
C  -0.697388 0.816586 0.833869
C  1.465803 -0.00057 -0.026445
C  0.737866 -0.820126 -0.934751
C  0.710895 0.820443 0.853952
C  2.955469 0.002665 -0.006427
C  3.671041 0.2168 1.205253
C  3.707426 -0.209908 -1.196085
C  5.081741 0.220355 1.227167
C  5.118266 -0.209849 -1.175545
C  5.814686 0.006104 0.036488
H  -5.636765 2.046353 0.74173
H  -5.220677 1.553577 -0.918154
H  -3.550724 1.166614 1.645526
H  -3.122267 2.118736 0.213941
H  -6.899029 -0.039549 0.135635
H  -5.717236 -0.404897 1.417582
H  -5.520764 -1.065227 -1.588778
H  -5.463943 -2.190505 -0.226935
H  -3.106384 -1.957072 -0.936839
H  -1.183746 -1.456083 -1.684961
H  -1.233896 1.469524 1.530372
H  1.282082 -1.477917 -1.622317
H  1.23232 1.493885 1.544005
H  3.117228 0.349967 2.141573
H  3.182807 -0.345213 -2.148766
H  5.609601 0.379227 2.174411
H  5.67467 -0.367694 -2.106483
H  6.9102 0.007219 0.052917
