program: Gaussian 09
title: 000227383
version: EM64L-G09RevD.01
frameworkgroup: C1[X(C17H14O2)]
method: RPBEPBE
basis: SDD
operation: Freq
keyword: #pfreq=noraman
keyword: PBEPBE/SDD
title: #p freq=noraman PBEPBE/SDD
converged: YES YES NO NO
title: Mulliken charges:
elementType: O O C C C C C C C C C C C C C C C C C H H H H H H H H H H H H H H
charge: -0.463356 -0.200250 -0.017127 -0.619921 0.362438 0.404050 0.097225 -0.515974 0.286923 -0.384583 -0.417378 -0.358528 -0.360504 -0.225274 -0.218030 -0.246727 -0.240038 -0.243674 -0.232797 0.262340 0.277254 0.270184 0.352783 0.240838 0.283253 0.232382 0.295954 0.226629 0.226667 0.228635 0.231066 0.231762 0.233780
chargesum: 0.00000
title: Mulliken charges with hydrogens summed into heavy atoms:
elementType: O O C C C C C C C C C C C C C C C C C
charge: -0.110573 -0.200250 -0.017127 -0.080327 0.362438 0.404050 0.097225 -0.245790 0.286923 -0.143745 -0.134125 -0.126147 -0.064550 0.001355 0.008637 -0.018092 -0.008972 -0.011912 0.000983
polarizability: 1.99516468e+02 -1.95659387e+01 2.27747767e+02 -1.27406197e+01 -1.74496507e+01 1.44783156e+02
1716.lowfreq: -8.6618 0.0003 0.0008 0.0009 6.5678 7.7524 32.4881 37.3654 48.6373
frequency: 32.3617 37.3028 48.5902 58.9439 104.8364 128.4716 172.9951 192.2173 243.7136 260.7970 274.5876 319.9975 330.2450 371.0050 394.7462 399.8997 402.2821 424.8343 465.4398 500.2990 543.4822 598.7516 615.0152 616.2814 627.0388 649.0591 670.9884 691.4424 705.3230 710.3118 773.8362 781.3048 841.4522 850.8602 859.6844 861.4403 881.1652 889.9969 932.0302 936.1340 960.6154 983.0427 984.8933 990.2948 990.5204 1000.5807 1002.7663 1005.7792 1027.9386 1032.2569 1075.8573 1084.1083 1089.2867 1136.8874 1157.0108 1172.8610 1176.5255 1189.0516 1200.2188 1207.8643 1224.0969 1251.2814 1284.1217 1310.1377 1330.6485 1337.1524 1380.6964 1382.2442 1428.9789 1436.5938 1438.6915 1482.7644 1484.1416 1572.8182 1588.4792 1593.7301 1607.9382 1614.1814 1626.1332 3022.3101 3082.5405 3117.1891 3127.9891 3128.3194 3137.5598 3141.8106 3150.0944 3159.5312 3164.0229 3174.9371 3180.4136 3182.3042 3560.1956
redmass: 4.3819 4.1290 4.0082 5.3421 4.3881 5.2381 4.3276 4.5939 5.0339 4.7328 4.6086 3.6459 1.2159 5.9541 4.1083 3.0821 2.8570 5.0680 2.8037 3.3752 3.4172 3.9042 6.0214 6.4274 6.1236 6.3616 4.1380 1.7783 2.4946 2.6255 1.8325 1.9696 3.1189 1.3399 1.6383 1.6644 2.4915 2.5298 1.4250 1.4846 2.6849 1.5943 1.3904 5.9838 3.8750 1.3164 1.3909 3.1261 2.2044 2.1058 3.6143 1.5420 1.7381 1.3095 1.7841 1.0604 1.0597 1.1492 1.2908 2.1045 1.7388 1.9329 3.4113 1.5299 1.4661 1.6771 6.9851 8.3537 1.1390 2.0836 2.2565 2.3189 2.2487 5.8152 7.1618 6.5367 6.1518 6.0959 10.4030 1.0612 1.1015 1.0869 1.0872 1.0850 1.0886 1.0932 1.0941 1.0982 1.0988 1.0963 1.0965 1.0960 1.0661
irintensity: 0.7030 1.3613 0.5773 1.3907 0.2026 0.8528 3.8429 1.1116 1.8878 2.6087 1.2177 9.3057 103.5572 11.3034 4.4300 2.1924 0.5829 19.6832 4.1052 3.7532 1.8271 10.7801 3.2849 0.5442 19.8020 1.9022 0.4068 46.3988 19.3011 42.3537 34.9898 57.8200 17.6646 9.2486 5.2775 7.3622 3.0322 8.0798 5.1588 0.6196 49.8797 0.5619 0.4277 1.1862 1.8122 1.0313 1.1381 41.0332 6.3242 3.7293 12.2580 3.5995 7.6193 20.0955 46.4881 1.0362 0.2406 3.3370 10.3725 145.6438 18.8820 8.2267 42.1250 4.1033 22.6194 31.4414 5.5244 3.6803 20.6471 20.7555 10.1484 15.4291 11.6810 77.1407 98.0891 31.9337 94.6289 5.5984 251.1190 4.4224 3.6247 6.0707 2.1096 0.6105 4.0561 28.2268 24.1569 25.7582 25.5060 8.1548 7.1271 7.2331 9.8223
temp: 298.150 k
press: 1.00000 atm
elementType: 8 8 6 6 6 6 6 6 6 6 6 6 6 6 6 6 6 6 6 1 1 1 1 1 1 1 1 1 1 1 1 1 1
symmnumber: 1
zpe: 678112.6 jmol-1
zpe.correction: 0.258279 hartree
zpe.thermalcorrener: 0.274067 hartree
zpe.thermalcorrenthalpy: 0.275011 hartree
zpe.thermalcorrgfe: 0.213982 hartree
zpe.sumelectzpe: -805.325523 hartree
zpe.sumelectthermal: -805.309736 hartree
zpe.sumelectthermalent: -805.308792 hartree
zpe.sumelectthermalfe: -805.369820 hartree
dipole: 2.1419 -3.4195 0.3667
dipole: 4.0516
quadrupole: -101.5661 -123.4743 -104.2683
quadrupole: 6.0446 -3.4300 4.3090
quadrupole: 8.2035 -13.7048 5.5012 6.0446 -3.4300 4.3090
hfenergy: -805.5838029 hartree
pointgroup: C01 [X(C17H14O2)]
dipole: 0.9155575 1.2999508 -0.1129342 debye
polarizability: 199.5368438|22.4775056|224.865691|15.1893551|-18.5319178|147.6448575 unknown
InChI: InChI=1S/C17H14O2/c18-15-11-16(13-7-3-1-4-8-13)17(19,12-15)14-9-5-2-6-10-14/h1-11,19H,12H2
charge 0 multiplicity 1
33 atoms
O  -0.571458 -0.631732 -2.166379
O  -1.26585 -4.207832 0.589382
C  -0.830586 -0.771539 -0.70815
C  -1.773363 -1.98322 -0.422626
C  0.497605 -1.154686 0.006985
C  -1.441638 0.554887 -0.244696
C  -0.90041 -3.041748 0.272497
C  0.424314 -2.435738 0.508426
C  1.663447 -0.254183 0.071017
C  -1.506137 0.851607 1.139926
C  -2.006071 1.461295 -1.173369
C  2.720075 -0.507945 0.995341
C  1.766879 0.885462 -0.779087
C  -2.123093 2.038758 1.589533
C  -2.623583 2.650147 -0.72184
C  -2.685813 2.94378 0.659271
C  3.839843 0.342381 1.065431
C  2.890854 1.733315 -0.708672
C  3.931544 1.468036 0.211177
H  -2.225904 -2.372314 -1.351178
H  -2.604738 -1.70736 0.249383
H  1.228978 -2.991953 0.995061
H  -0.169488 -1.476511 -2.493828
H  -1.067303 0.158969 1.868801
H  -1.951197 1.230412 -2.240612
H  2.652364 -1.363004 1.676918
H  0.973548 1.08475 -1.503899
H  -2.16236 2.259313 2.66217
H  -3.057041 3.345464 -1.449707
H  -3.164559 3.865766 1.007645
H  4.637447 0.135078 1.787171
H  2.95599 2.602178 -1.372468
H  4.802001 2.131166 0.266576
