program: Gaussian 09
title: 000227327
version: EM64L-G09RevD.01
frameworkgroup: C1[X(C11H9NO4S)]
method: RPBEPBE
basis: SDD
operation: Freq
keyword: #p
keyword: freq=noraman
keyword: PBEPBE/SDD
title: #p freq=noraman PBEPBE/SDD
converged: YES YES NO NO
title: Mulliken charges:
elementType: S O O O O N C C C C C C C C C C C H H H H H H H H H
charge: 0.352683 -0.261102 -0.220982 -0.217060 -0.207459 0.085247 0.518089 0.401790 -0.383881 -0.650913 -0.348434 -0.369447 -0.254214 -0.236378 -0.227076 0.272173 -0.499597 0.301494 0.253848 0.235137 0.253184 0.236045 0.239117 0.251475 0.240699 0.235565
chargesum: 0.00000
title: Mulliken charges with hydrogens summed into heavy atoms:
elementType: S O O O O N C C C C C C C C C C C
charge: 0.352683 -0.261102 -0.220982 -0.217060 -0.207459 0.085247 0.518089 0.401790 -0.383881 -0.095571 -0.348434 -0.134311 -0.001030 -0.000333 0.012040 0.272173 0.228142
polarizability: 2.14979366e+02 -2.79477772e+01 1.96688355e+02 1.84118503e+01 1.33524093e+01 8.52800472e+01
1716.lowfreq: -6.9637 0.0017 0.0019 0.0023 4.4231 7.0247 14.5373 33.8639 58.3802
frequency: 13.7101 33.7771 58.3788 81.3941 86.3387 97.5678 148.7699 151.7141 169.4894 225.1642 242.9434 292.1735 305.2207 323.2260 336.5912 365.0968 424.9940 450.1085 487.9682 492.4803 533.8955 570.5965 594.4064 630.4876 672.2859 684.4365 706.7290 721.9910 736.8151 773.6998 816.5741 852.0642 868.5013 944.1443 952.6983 964.5573 991.5112 1006.5931 1025.5408 1039.0380 1105.6471 1114.9963 1132.1273 1144.3465 1150.5376 1179.2023 1197.7224 1225.3226 1265.8475 1302.6087 1331.7745 1369.7916 1394.1154 1423.1520 1427.1285 1439.7116 1453.3244 1463.6555 1464.5053 1531.1614 1567.0560 1602.8022 1657.6573 3007.5626 3025.8829 3086.0718 3111.6867 3137.2220 3145.8988 3153.0256 3159.2660 3173.3921
redmass: 4.9983 7.9032 6.1363 9.6982 5.5553 1.1770 4.9439 3.7920 7.1048 5.6469 6.3305 3.4907 5.9173 9.8637 5.0463 6.0255 3.1253 13.8587 4.7823 8.3666 3.0957 5.2676 6.1757 5.6689 7.9223 6.6567 7.8206 9.5621 2.0470 1.9263 4.3444 2.8647 1.8460 7.2119 1.3934 3.0560 1.3407 7.3264 2.2760 5.0225 4.1368 1.2649 4.1581 1.6173 1.4499 1.1106 1.2193 7.5785 1.5369 1.6407 7.3632 3.0882 6.1831 1.1797 2.5969 1.2300 1.0496 1.0522 2.7465 7.4168 6.7501 6.5469 9.1037 1.0294 1.0603 1.0987 1.1049 1.0858 1.0894 1.1051 1.0953 1.1006
irintensity: 1.2893 0.5248 0.8618 0.1495 0.1097 0.1841 0.3279 5.8201 0.7672 5.9023 9.2033 4.5842 0.6667 4.2903 10.4178 2.2629 8.1578 0.0197 2.6483 1.5192 5.0325 7.4445 7.0704 2.2844 10.5004 2.0157 2.0035 11.5769 27.5830 68.3609 4.4838 1.0858 0.3611 17.7453 0.9686 4.7131 0.1200 2.6925 3.9278 2.1103 25.5659 0.3948 374.9285 29.5358 18.0579 0.1973 23.9117 403.7134 10.0135 94.3544 95.3221 96.1699 1.9720 23.2202 8.3453 26.5901 15.1259 13.6048 8.1796 110.8390 9.2863 14.8934 138.7398 33.4008 6.3635 1.6987 20.7279 0.4914 4.0500 15.5776 14.9978 22.9453
temp: 298.150 k
press: 1.00000 atm
elementType: 16 8 8 8 8 7 6 6 6 6 6 6 6 6 6 6 6 1 1 1 1 1 1 1 1 1
symmnumber: 1
zpe: 477416.9 jmol-1
zpe.correction: 0.181838 hartree
zpe.thermalcorrener: 0.197485 hartree
zpe.thermalcorrenthalpy: 0.198430 hartree
zpe.thermalcorrgfe: 0.136267 hartree
zpe.sumelectzpe: -1176.973358 hartree
zpe.sumelectthermal: -1176.957711 hartree
zpe.sumelectthermalent: -1176.956767 hartree
zpe.sumelectthermalfe: -1177.018930 hartree
dipole: 2.4553 -5.7216 -1.1501
dipole: 6.3315
quadrupole: -83.5131 -108.9105 -108.8791
quadrupole: 6.2268 0.6294 1.5384
quadrupole: 16.9211 -8.4763 -8.4448 6.2268 0.6294 1.5384
hfenergy: -1177.1551969 hartree
pointgroup: C01 [X(C11H9N1O4S1)]
dipole: 1.2454713 -2.0664806 -0.6192931 debye
dipolederiv: -0.1080765 -0.0341146 -0.0427013 0.0115059 -0.1715138 -0.0764811 -0.0541205 -0.0991041 0.1128926 -1.3283326 -0.5836057 -0.0520731 -0.6060875 -0.6071164 -0.0507559 -0.0610558 -0.0168228 -0.5001079 -0.6004973 -0.1960565 0.0253977 -0.2426616 -0.3655465 0.0047932 -0.1875896 -0.0667168 -0.8251627 -1.0187466 0.1333291 -0.1267693 -0.106616 -0.4304632 -0.0580524 -0.2099432 -0.0223007 -0.2612336 -0.4873411 0.0572617 -0.0314769 0.1615467 -0.9438117 -0.139105 -0.013294 -0.200561 -0.2685002 1.6364604 -0.6202927 0.1197537 -0.4725572 1.4929311 0.2237869 0.1638845 0.2546439 0.2881281 0.5188259 -0.001749 0.0389577 -0.4406897 0.3402794 -0.0581633 0.0182265 0.0710997 -0.0201287 -0.4538561 -0.0319386 -0.1008458 0.0675669 -0.1607887 -0.0324895 -0.0947827 -0.0575162 0.001909 0.1376286 -0.3573441 -0.0582803 -0.0980405 0.2940145 0.0992043 0.0200101 0.0380173 -0.0700533 -0.215169 -0.2076081 0.0861235 -0.1297811 0.0492297 0.0594502 0.2007118 0.1617948 -0.1502956 -0.249364 0.713708 0.160452 0.9579879 -0.5892765 0.0616367 0.231671 -0.0083889 -0.0100051 0.1822078 0.0315428 0.0687656 -0.16938 0.0938721 0.0250723 0.0054952 0.068484 -0.10271 -0.0259328 0.2034454 0.0848259 0.2079691 -0.1926708 0.0235724 0.0902274 0.0238115 -0.0878718 -0.2892588 -0.0444029 -0.0313281 -0.1353662 0.1310245 0.0606183 -0.069973 0.0695704 -0.146065 0.1085422 0.0251718 0.0694627 0.0525434 0.058938 0.068404 0.0784629 0.068492 -0.1017302 1.5222091 0.7603387 0.0289861 0.790569 0.5899281 0.040474 0.1443802 0.007743 1.0854225 0.5561329 0.1501916 -0.0594897 0.1704612 0.3349868 -0.0340069 -0.2126602 -0.1271173 0.2512317 0.0398047 0.0014005 -0.0422594 0.0306477 0.0536411 0.0565234 -0.0076983 0.0036193 0.0951973 0.0636796 0.0401682 0.0709692 -0.0156235 -0.0331887 -0.0753616 0.027395 -0.0488898 0.0844082 0.0275144 -0.0952977 -0.0630358 -0.0616877 0.0168209 -0.0440259 -0.0471007 -0.0576784 0.118737 0.0358543 -0.02598 -0.0367981 -0.0860877 0.0263721 -0.0625573 -0.0577981 -0.050743 0.1352892 0.0600154 0.0651264 -0.002736 0.0817876 -0.0773217 -0.0568345 0.0008599 -0.0582557 0.1444287 -0.0910267 0.053146 -0.0407589 0.0595941 0.082971 -0.0107347 -0.0425977 -0.0105229 0.1493213 0.0194329 -0.0060716 0.0383102 0.0605812 -0.0459737 -0.0716248 0.1172959 -0.0202086 0.0408916 -0.0023302 0.0611974 -0.0501223 0.0048783 -0.0140278 0.0842062 0.0495997 0.1310763 0.0085759 -0.0383766 -0.091566 -0.053329 -0.0930604 0.0666902 -0.0375489 -0.0896061 -0.053526 0.027431 unknown
polarizability: 222.233163|-25.495545|186.9065794|13.1513618|23.3878835|87.8080263 unknown
InChI: InChI=1S/C11H9NO4S/c1-16-10(13)6-8-7-4-2-3-5-9(7)17-11(8)12(14)15/h2-5H,6H2,1H3
charge 0 multiplicity 1
26 atoms
S  1.470772 2.116644 0.556111
O  -3.235396 -1.817127 -0.414566
O  -1.971039 -1.0444 1.384363
O  -2.384908 1.810292 -0.413852
O  -1.062042 3.50073 0.390563
N  -1.24171 2.282784 -0.01769
C  -0.030452 0.086241 -0.449152
C  1.313467 -0.442669 -0.297322
C  2.245999 0.514569 0.224567
C  -1.190933 -0.724694 -0.964181
C  -0.091847 1.41292 -0.032911
C  1.779302 -1.755876 -0.594234
C  3.600449 0.195457 0.445539
C  3.127395 -2.080545 -0.3746
C  4.034401 -1.11085 0.140466
C  -2.134443 -1.183119 0.155584
C  -4.265003 -2.295089 0.542979
H  -1.803523 -0.143929 -1.673426
H  -0.83571 -1.623583 -1.498175
H  1.089701 -2.511652 -0.984628
H  4.299987 0.936261 0.844848
H  3.488042 -3.089635 -0.598549
H  5.082437 -1.382656 0.304964
H  -4.674276 -1.44249 1.109468
H  -3.825674 -3.023263 1.245188
H  -5.035696 -2.76162 -0.085751
