program: Gaussian 09
title: 000021422
version: EM64L-G09RevD.01
frameworkgroup: C1[X(C6H9N3S2)]
method: RPBEPBE
basis: SDD
operation: Freq
keyword: #pfreq=noraman
keyword: PBEPBE/SDD
title: #p freq=noraman PBEPBE/SDD
converged: YES YES NO NO
title: Mulliken charges:
elementType: S S N N N C C C C C C H H H H H H H H H
charge: 0.290902 0.290779 0.010609 0.009377 0.072836 0.059592 -0.342345 -0.341771 -0.740943 -0.827582 -0.827605 0.247912 0.248595 0.245689 0.276256 0.249645 0.276096 0.276232 0.276077 0.249649
chargesum: 0.00000
title: Mulliken charges with hydrogens summed into heavy atoms:
elementType: S S N N N C C C C C C
charge: 0.290902 0.290779 0.010609 0.009377 0.072836 0.059592 -0.342345 -0.341771 0.001252 -0.025585 -0.025646
polarizability: 1.58156098e+02 1.27727004e-01 1.60199955e+02 2.23296448e-03 6.82572290e-01 5.94835373e+01
1716.lowfreq: -43.5110 -11.4780 -0.0019 -0.0014 -0.0007 6.1818 7.9518 56.7049 80.0228
frequency: -43.4923 56.6989 79.9497 95.6073 109.2600 116.5778 148.5058 163.8172 182.9838 189.2110 250.4049 300.2789 378.4253 420.1181 498.1648 556.6861 584.4798 625.3125 660.8745 661.8638 792.4378 793.4616 889.4654 906.0436 977.1354 979.1998 991.0905 991.3747 1001.2790 1050.1356 1173.2063 1219.7638 1222.5604 1338.4795 1340.4337 1349.6003 1397.1801 1411.3532 1435.0809 1435.4543 1438.4851 1444.3504 1453.7204 1464.9903 1467.5198 2997.0166 3024.7604 3025.2827 3088.5997 3137.3960 3148.9394 3149.7091 3155.5004 3155.5797
redmass: 1.0151 3.0851 3.2578 1.0573 1.2401 3.7898 4.0909 10.3698 5.2055 3.3193 3.3287 4.6740 15.0336 6.4544 5.9525 5.4940 4.1331 12.2572 7.3030 7.3367 8.2613 9.6615 9.3653 9.6139 1.1814 1.1809 1.3044 1.2688 1.6993 1.6502 10.7159 6.1657 9.3192 4.2686 1.1693 1.1621 1.4125 3.7960 1.0527 1.9408 1.0549 1.0518 1.0655 1.7811 1.2779 1.0413 1.0281 1.0282 1.0905 1.1023 1.1042 1.1040 1.1057 1.1057
irintensity: 0.2288 0.0001 6.1269 0.0002 0.6305 0.1109 0.0802 0.0026 0.9061 5.3629 2.3335 4.3597 1.5937 0.9604 0.0429 18.4021 2.8290 0.0001 2.1467 0.0006 2.1306 82.0573 29.0280 2.9929 0.0003 16.7266 2.5764 1.1376 11.4682 12.2674 32.3567 223.0307 101.0010 27.4224 26.8408 14.5028 6.1406 650.2348 0.0589 325.3181 31.5353 45.7622 43.9316 165.9692 65.2395 2.7526 1.0552 32.8962 10.9791 6.4259 18.0285 1.0132 23.1405 0.1069
temp: 298.150 k
press: 1.00000 atm
elementType: 16 16 7 7 7 6 6 6 6 6 6 1 1 1 1 1 1 1 1 1
symmnumber: 1
zpe: 382361.2 jmol-1
zpe.correction: 0.145634 hartree
zpe.thermalcorrener: 0.157795 hartree
zpe.thermalcorrenthalpy: 0.158740 hartree
zpe.thermalcorrgfe: 0.106118 hartree
zpe.sumelectzpe: -1193.577099 hartree
zpe.sumelectthermal: -1193.564937 hartree
zpe.sumelectthermalent: -1193.563993 hartree
zpe.sumelectthermalfe: -1193.616614 hartree
dipole: 0.0015 -2.7851 0.0962
dipole: 2.7867
quadrupole: -87.4394 -65.4967 -80.5987
quadrupole: 0.0552 -0.0003 0.2796
quadrupole: -9.5945 12.3482 -2.7537 0.0552 -0.0003 0.2796
hfenergy: -1193.7227323 hartree
pointgroup: C01 [X(C6H9N3S2)]
dipole: 1.0956672 -0.0020609 -0.0396174 debye
dipolederiv: -0.1878874 -0.3377703 -0.0001906 -0.4723533 -0.4985099 0.0009413 0.0005688 0.0008116 -0.0626377 -0.1877745 0.3373262 -0.0001234 0.47262 -0.4980724 -0.0010194 0.0006412 -0.0008505 -0.0628216 -1.321624 0.6328994 -0.0025389 0.3053561 -0.9501587 0.0094515 0.0020004 -0.0045847 -0.155631 -1.3191142 -0.6325552 -0.0027515 -0.3025787 -0.9495047 -0.0095468 0.0022743 0.0047392 -0.1549561 -0.5046606 0.0002273 -0.0011446 -0.0003467 -1.8933182 -0.0001734 0.0047658 -0.0002585 -0.0855346 1.3823537 0.0005194 0.0315176 0.0035302 1.1497923 0.0001846 0.0853679 0.0001254 0.0884845 1.0272075 0.5516939 0.0014073 0.6035671 1.6787251 0.0004188 -0.0126872 -0.0057648 0.0380563 1.026568 -0.5507769 0.0012604 -0.6036486 1.6788908 -0.0001293 -0.0128594 0.006008 0.0372581 -0.4459057 -0.0020784 -0.0312004 -0.0195786 0.0261512 -0.0000848 -0.1878795 -0.0001214 -0.0108937 0.1692504 0.0237259 -0.0006793 0.0542133 0.0002018 -0.0003223 -0.0005401 -0.0000509 0.0411149 0.1693375 -0.0238025 -0.0006464 -0.0541616 0.0000094 0.0003307 -0.0005445 0.0000684 0.0411661 0.0703807 -0.0140374 0.0201341 -0.057296 -0.0153341 0.0902074 0.0832864 0.0746455 0.0794116 0.0713113 0.0153042 0.0179515 0.0689844 -0.0252698 -0.0821351 0.0776737 -0.067863 0.0897763 0.0527817 -0.0004676 -0.0335389 0.0017818 0.122476 -0.0081006 -0.0431009 -0.0069091 -0.0651708 -0.0057824 0.0159154 -0.0254598 0.0913405 0.0686456 0.1004617 -0.0177163 0.0739616 -0.019614 0.0099107 -0.0936453 0.0006217 -0.1094717 -0.0501769 0.000531 0.0006693 0.0005732 0.1312361 -0.0052468 0.0150957 0.0251146 0.0903153 0.0684714 -0.1013419 0.0175853 -0.0742672 -0.0204151 -0.0058316 -0.0160018 -0.0255178 -0.0913664 0.0687637 -0.1004416 -0.017807 -0.073937 -0.0196926 -0.0052692 -0.01523 0.0251521 -0.0903779 0.0685096 0.1013475 0.0176234 0.0742836 -0.0203837 0.009995 0.0936579 0.0006321 0.1094707 -0.0502923 -0.0005793 0.0006783 -0.0006094 0.1312472 unknown
polarizability: 160.2022511|0.1249473|158.1557592|0.5183552|0.010629|59.4815802 unknown
InChI: InChI=1S/C6H9N3S2/c1-4-7-5(10-2)9-6(8-4)11-3/h1-3H3
charge 0 multiplicity 1
20 atoms
S  0.887651 2.75081 0.006318
S  0.886303 -2.750459 0.005743
N  -1.311428 -1.210655 0.017844
N  -1.310939 1.21233 0.018084
N  0.796992 0.000239 0.006336
C  -1.954709 0.0011 0.020067
C  0.053965 1.147183 0.009621
C  0.053163 -1.146449 0.009255
C  -3.457155 0.000533 0.002208
C  2.690138 2.212414 -0.003679
C  2.689039 -2.212867 -0.003946
H  -3.846063 -0.888982 0.521511
H  -3.845649 0.923828 0.458137
H  -3.817746 -0.038672 -1.043491
H  2.907535 1.619799 0.895617
H  3.271907 3.147086 -0.007306
H  2.897338 1.619326 -0.905088
H  2.90667 -1.620629 0.895538
H  2.896605 -1.619628 -0.905169
H  3.270382 -3.147808 -0.007801
