program: Gaussian 09
title: 000227313
version: EM64L-G09RevD.01
frameworkgroup: C1[X(C12H10ClNO)]
method: RPBEPBE
basis: SDD
operation: Freq
keyword: #p
keyword: freq=noraman
keyword: PBEPBE/SDD
title: #p freq=noraman PBEPBE/SDD
converged: YES YES NO NO
title: Mulliken charges:
elementType: Cl O N C C C C C C C C C C C C H H H H H H H H H H
charge: -0.079214 -0.244052 -0.440379 0.158166 0.428711 0.346301 -0.332880 -0.463310 -0.375794 -0.423749 -0.237316 -0.274611 -0.241639 0.243118 -0.670401 0.205547 0.240206 0.305657 0.240774 0.230428 0.323698 0.231411 0.232127 0.298620 0.298581
chargesum: 0.00000
title: Mulliken charges with hydrogens summed into heavy atoms:
elementType: Cl O N C C C C C C C C C C C C
charge: -0.079214 -0.244052 -0.116681 0.158166 0.428711 0.346301 -0.127332 -0.223104 -0.070138 -0.182975 -0.006888 -0.043199 -0.009512 0.243118 -0.073200
polarizability: 2.09925067e+02 1.33091434e+01 1.94156507e+02 7.94487130e-02 -4.50847945e-02 6.06405683e+01
1716.lowfreq: -7.9235 0.0009 0.0011 0.0021 5.6158 8.6900 27.5005 66.9842 74.7045
frequency: 27.4883 66.9822 74.7010 84.6445 143.9256 178.8019 189.1304 257.1615 277.2142 369.5594 418.9532 425.5506 447.2008 472.3143 510.3962 528.1849 542.6714 578.4643 646.5206 647.2392 674.0135 712.7283 751.0529 766.4475 782.9057 786.9777 814.4607 864.1338 873.3133 904.2115 931.5808 932.1671 956.0985 988.8866 996.5735 1030.9207 1057.1272 1091.9418 1149.6564 1154.2959 1184.4297 1191.1497 1217.4790 1237.1071 1256.8535 1279.8103 1291.8980 1372.1421 1408.4330 1418.3066 1423.1686 1446.1603 1455.7082 1506.6685 1551.0483 1590.6168 1599.1265 1611.5915 1637.6367 3071.3231 3114.9617 3126.7240 3131.2647 3144.8100 3153.9146 3156.0453 3165.0402 3191.7748 3480.8707
redmass: 7.0988 5.7920 2.8005 9.8433 3.6077 4.0816 8.7709 8.7847 3.6763 10.5489 2.9436 4.9831 6.5820 3.3560 7.0459 6.8326 3.0373 2.8240 3.1658 5.8200 6.5598 1.4672 1.1903 5.6633 5.4838 1.9991 1.4424 4.8539 1.8894 1.7113 6.3226 1.3573 1.4052 1.3392 1.3604 3.1528 2.5537 2.2410 1.1097 1.4209 1.1112 1.3554 2.1233 1.9184 1.1872 1.8762 2.2613 2.3860 2.7861 1.5918 2.2223 2.4909 2.3378 2.9824 2.3824 6.8162 5.6179 5.7668 5.3357 1.0564 1.0869 1.0878 1.0872 1.0939 1.1096 1.0965 1.1004 1.0948 1.0754
irintensity: 0.0496 3.0078 13.4220 0.2826 0.6317 3.2056 8.7403 3.4585 2.3197 1.5141 10.5070 2.2224 30.0383 0.3166 0.5181 5.7962 1.8842 1.2995 0.1270 0.6540 77.7066 19.9012 43.6275 2.2042 0.5542 69.2967 79.2525 1.9935 16.8586 10.5978 0.8051 3.7143 1.6787 0.6717 5.3685 7.6723 1.2218 10.5744 0.5029 3.1767 1.5647 3.6326 7.7463 4.3463 14.2057 1.6746 18.6178 15.8314 33.6161 59.1670 5.8532 0.0915 1.6879 171.9866 475.4673 6.0410 29.8326 198.9771 5.9884 5.0023 11.6595 0.8921 2.0565 27.5871 0.7188 30.9237 25.8316 4.1366 54.5615
temp: 298.150 k
press: 1.00000 atm
elementType: 17 8 7 6 6 6 6 6 6 6 6 6 6 6 6 1 1 1 1 1 1 1 1 1 1
symmnumber: 1
zpe: 499576.5 jmol-1
zpe.correction: 0.190279 hartree
zpe.thermalcorrener: 0.202919 hartree
zpe.thermalcorrenthalpy: 0.203864 hartree
zpe.thermalcorrgfe: 0.149543 hartree
zpe.sumelectzpe: -1052.291075 hartree
zpe.sumelectthermal: -1052.278434 hartree
zpe.sumelectthermalent: -1052.277490 hartree
zpe.sumelectthermalfe: -1052.331811 hartree
dipole: -1.2632 -1.6091 -0.0070
dipole: 2.0457
quadrupole: -82.4839 -93.8212 -98.5930
quadrupole: -2.0364 0.0014 -0.1005
quadrupole: 9.1488 -2.1885 -6.9603 -2.0364 0.0014 -0.1005
hfenergy: -1052.4813538 hartree
pointgroup: C01 [X(C12H10Cl1N1O1)]
dipole: -0.5933889 0.541221 0.0523802 debye
dipolederiv: -0.2849126 0.0399372 0.0128357 -0.2475026 -0.6810445 0.0310785 0.0161519 0.0016099 -0.1596447 -0.9335021 -0.0960826 0.0609664 0.6597507 -0.8223634 -0.0627918 0.0545863 0.0163178 -0.3534259 -1.8205425 -0.0984218 0.1606882 -0.007032 -0.4361445 0.0032008 0.1627151 0.0127284 -0.2790362 -0.1724461 -0.1888892 0.0203149 -0.0896649 0.0211282 0.0084179 0.0185086 0.0181616 -0.012534 -0.0702974 -0.0338828 0.0146076 -0.1507665 0.110547 0.0143997 0.0170107 0.0028842 0.0687898 0.945719 0.2263982 -0.09046 0.5184923 0.1466974 -0.0542932 -0.0952688 -0.0245549 0.0853013 0.0048453 0.0739259 -0.0186961 0.0681837 -0.0115372 -0.0098112 -0.0192202 -0.0105235 -0.1604868 -0.0527861 0.1034871 -0.0161558 0.0285076 -0.0655886 -0.0051869 -0.0151401 -0.0127343 -0.1936307 -0.1204149 0.0156768 -0.00409 -0.2086483 -0.1920506 0.0212723 -0.0011408 -0.0006638 -0.1631181 0.1120517 0.0420781 -0.0286722 0.1081175 -0.0000568 -0.0140655 -0.029796 -0.0077122 -0.1656937 0.0237965 0.0008581 -0.0170117 0.1353914 0.1783092 -0.0198622 -0.0203947 -0.0059562 -0.1484106 -0.0556373 0.0487786 -0.0112181 0.0837445 0.1070888 -0.0139713 -0.0120565 -0.0104623 -0.1576464 0.1092016 -0.0472578 -0.0258576 -0.0662297 -0.0747834 0.0049021 -0.0254092 0.0031783 -0.1582102 1.9259147 0.1917386 -0.1828008 -0.9572858 0.7709259 0.0916431 -0.1709611 -0.0273103 0.202317 -0.0381441 -0.2672582 0.022766 0.1090185 0.750241 -0.0169528 0.018002 0.0217028 0.1475721 -0.0845838 -0.1067771 0.0258397 -0.0815236 0.0303519 0.0107937 0.0257214 0.0134181 0.1513588 -0.070512 -0.1109878 0.0251962 -0.0387684 0.0417506 0.0062113 0.0239129 0.0132057 0.1592174 0.1011938 0.0611117 0.0063797 0.0554663 0.1220174 -0.0041622 0.006148 -0.0056154 0.1805643 -0.0542474 -0.0494809 0.0216806 -0.1207633 0.0244644 0.0145646 0.0231244 0.0074235 0.1519246 0.0822222 0.0065836 0.0071772 -0.0183879 -0.1249027 0.0073685 0.007869 0.0047611 0.1550252 0.3509468 0.0882146 -0.0090323 0.0853857 0.2192251 -0.008291 -0.0092946 -0.009001 0.2668284 0.0857457 -0.006166 0.0076416 0.0159615 -0.1231864 0.0041989 0.0070651 0.0064275 0.1605341 -0.0827789 0.0975093 0.0225463 0.1033762 0.0341336 -0.0076818 0.0224571 -0.0071243 0.1615665 0.0652646 0.0059261 0.0517832 0.0059663 -0.0127635 -0.0266854 0.0867956 0.0070894 0.0151179 0.0339035 0.0029804 -0.0564287 0.0092108 -0.012459 0.025704 -0.091386 -0.0072502 0.0457196 unknown
polarizability: 212.3783911|-10.1553624|190.1740711|-15.0201571|-1.3312057|62.1696797 unknown
InChI: InChI=1S/C12H10ClNO/c13-8-12(15)14-11-7-3-5-9-4-1-2-6-10(9)11/h1-7,14H,8H2
charge 0 multiplicity 1
25 atoms
Cl 3.425473 2.54142 -0.499165
O  3.166509 -1.530552 -0.423524
N  1.539901 0.182708 -0.273757
C  -0.908172 0.229833 -0.034076
C  -2.157332 -0.493778 0.103714
C  0.318608 -0.537942 -0.139757
C  -0.956265 1.664988 -0.058492
C  -2.153222 -1.92696 0.131248
C  0.289467 -1.941459 -0.109399
C  -3.3847 0.240673 0.210766
C  -0.952543 -2.627897 0.026211
C  -2.168639 2.351968 0.047945
C  -3.39731 1.635477 0.1843
C  2.818714 -0.309689 -0.402119
C  3.953456 0.71325 -0.534963
H  -0.044377 2.26496 -0.162316
H  -3.105829 -2.458437 0.23595
H  1.224645 -2.498042 -0.190847
H  -4.320749 -0.320744 0.314702
H  -0.948691 -3.722796 0.046986
H  1.479736 1.205855 -0.279011
H  -2.177416 3.446961 0.026544
H  -4.341427 2.18417 0.267113
H  4.467913 0.569785 -1.496269
H  4.660653 0.59015 0.298115
