program: Gaussian 09
title: 000227305
version: EM64L-G09RevD.01
frameworkgroup: C1[X(C15H23NO4S)]
method: RPBEPBE
basis: SDD
operation: Freq
keyword: #p
keyword: freq=noraman
keyword: PBEPBE/SDD
title: #p freq=noraman PBEPBE/SDD
converged: YES YES NO NO
title: Mulliken charges:
elementType: S O O O O N C C C C C C C C C C C C C C C H H H H H H H H H H H H H H H H H H H H H H H
charge: 0.948100 -0.538238 -0.519966 -0.441422 -0.252530 -0.563315 -0.374993 -0.379593 -0.316027 -0.372082 -0.608189 -0.353402 -0.355964 -0.694712 0.409912 -0.369645 -0.286879 -0.329745 -0.322699 0.264431 0.114632 0.202607 0.202397 0.201244 0.200773 0.235626 0.237620 0.191763 0.191562 0.278268 0.278581 0.190366 0.190482 0.195326 0.195207 0.297046 0.210605 0.210632 0.216837 0.234285 0.245623 0.274298 0.276155 0.385021
chargesum: 0.00000
title: Mulliken charges with hydrogens summed into heavy atoms:
elementType: S O O O O N C C C C C C C C C C C C C C C
charge: 0.948100 -0.538238 -0.519966 -0.056401 -0.252530 -0.266269 0.030011 0.022425 0.157219 0.011243 -0.051340 0.027446 0.034569 -0.056638 0.409912 -0.135360 -0.041255 -0.055446 -0.046543 0.264431 0.114632
polarizability: 4.00243240e+02 3.30780209e+01 2.04422530e+02 3.58433473e+00 -6.84104682e+00 1.40982197e+02
1716.lowfreq: -32.0131 -6.6777 -4.6250 -0.0022 -0.0018 0.0009 4.6945 7.5896 15.5897
frequency: -28.4006 3.7416 14.6345 24.1903 38.0652 42.6172 58.9189 67.6800 78.0895 89.6698 92.7058 116.5456 123.8538 126.1635 135.3804 158.0784 169.0326 181.2160 220.7610 232.1820 246.6065 274.6172 296.4275 310.1757 355.0020 355.7500 405.6307 416.3266 432.1943 443.6489 488.3577 495.2118 516.5392 570.0799 589.9296 604.0284 629.6835 681.7039 707.2365 721.7029 731.1998 754.9997 759.9240 785.3199 810.0310 819.7456 828.4483 843.8025 848.2681 855.9347 888.1782 911.8963 947.0667 978.9764 984.9289 986.8747 996.9668 1004.4161 1011.5822 1020.8243 1037.2632 1063.6342 1072.2493 1078.5861 1081.4957 1117.6053 1118.2773 1149.5031 1184.3318 1191.9408 1211.0310 1216.3144 1230.1397 1241.1665 1242.8606 1255.2793 1279.3016 1280.6286 1282.5803 1292.1591 1296.8190 1315.9202 1317.4564 1323.6266 1340.5822 1349.8659 1353.1105 1388.8504 1399.6881 1406.9606 1428.1334 1460.8739 1461.5027 1466.3547 1471.8563 1477.4374 1478.8543 1485.4209 1488.5489 1490.7251 1567.0525 1610.8407 1638.1373 2951.4174 2954.9329 2960.2905 2965.8361 2970.0695 2972.2888 2987.3236 2996.3158 2998.5185 3009.6221 3026.5453 3041.1864 3048.6574 3062.9368 3068.8408 3071.8745 3130.0803 3138.8541 3164.6894 3165.0936 3185.9057 3347.8298 3534.2586
redmass: 1.6399 5.7068 5.4014 4.9533 3.8500 3.5150 6.7257 1.9639 5.9382 5.1268 2.4199 6.1975 2.0534 5.1238 2.1137 10.8281 4.4259 6.4160 5.9040 1.1001 3.9505 3.6917 4.6067 5.9548 6.1966 7.0900 3.0440 3.6852 3.5237 4.6533 4.7464 4.5412 3.1406 4.9029 1.2841 5.0473 6.7505 3.2424 5.0832 1.0633 1.0852 1.1151 4.4578 1.1987 2.5525 3.9489 2.4171 1.3466 1.4527 1.7503 1.9038 1.6356 2.0246 1.3776 1.3734 4.9045 4.1985 1.2198 3.6220 2.8886 3.4890 2.8882 2.5809 2.2229 1.2163 1.4431 2.3200 1.6538 1.8022 1.2219 1.2494 1.4369 1.2424 1.3671 2.9958 1.3032 1.2809 1.0279 1.1858 1.0742 1.1169 1.3614 1.3437 2.8191 1.4042 1.5365 1.6585 1.2160 3.5418 1.1264 3.6141 1.0707 1.0729 1.0698 1.0788 1.0425 1.0785 1.0865 1.0939 2.5855 6.7009 6.1541 8.5792 1.0587 1.0587 1.0587 1.0592 1.0587 1.0362 1.0972 1.0587 1.0995 1.1024 1.1045 1.1048 1.0559 1.1048 1.1007 1.0993 1.0895 1.1101 1.0918 1.0925 1.0972 1.0744 1.0642
irintensity: 0.0229 0.0093 1.0698 1.3521 0.4409 1.0826 0.7822 0.5389 1.1818 1.7069 0.0066 0.5022 0.9156 7.0550 0.0055 12.6432 2.4483 7.6778 6.0497 0.0018 0.8257 12.8430 39.7244 10.0747 13.2828 18.8429 11.9038 10.9312 14.5864 62.5626 14.9405 40.3041 21.3338 72.8569 75.5628 14.7683 1.2311 76.0732 2.2670 13.2299 0.4790 6.2217 15.1822 0.2259 112.0825 46.5788 4.1072 4.4834 53.4831 101.4188 5.7837 13.2886 14.7173 5.4369 0.2201 1.2539 136.0025 3.1586 8.0344 210.1350 1.4398 4.3445 0.1546 1.6108 4.1365 24.0220 22.3064 174.0986 0.3337 2.8823 7.5675 2.1916 10.2794 4.5659 33.1110 1.9228 12.8030 0.8121 1.7101 0.0082 0.0871 11.2479 7.5098 161.9589 16.8485 0.0898 0.3705 11.4637 13.4963 8.0866 21.6895 0.2240 0.3237 3.1848 0.3551 12.6787 2.2404 1.3158 33.7561 14.9478 16.1948 114.2100 402.0426 0.3790 4.9459 0.7673 9.0086 148.7806 44.1228 0.2380 18.5628 0.3101 1.2551 2.4294 97.6071 10.2176 33.9037 97.2732 54.2152 6.1173 3.3673 4.0131 2.1528 1.7380 12.9649 59.4102
temp: 298.150 k
press: 1.00000 atm
elementType: 16 8 8 8 8 7 6 6 6 6 6 6 6 6 6 6 6 6 6 6 6 1 1 1 1 1 1 1 1 1 1 1 1 1 1 1 1 1 1 1 1 1 1 1
symmnumber: 1
zpe: 937167.0 jmol-1
zpe.correction: 0.356948 hartree
zpe.thermalcorrener: 0.380763 hartree
zpe.thermalcorrenthalpy: 0.381707 hartree
zpe.thermalcorrgfe: 0.297458 hartree
zpe.sumelectzpe: -1337.328993 hartree
zpe.sumelectthermal: -1337.305178 hartree
zpe.sumelectthermalent: -1337.304234 hartree
zpe.sumelectthermalfe: -1337.388483 hartree
dipole: 4.2903 -1.6228 -3.5165
dipole: 5.7798
quadrupole: -141.0994 -130.8405 -142.2579
quadrupole: 4.3135 0.0182 -7.9102
quadrupole: -3.0335 7.2255 -4.1920 4.3135 0.0182 -7.9102
hfenergy: -1337.6859409 hartree
pointgroup: C01 [X(C15H23N1O4S1)]
dipole: -1.678389 1.2329371 -0.9130696 debye
polarizability: 401.4164498|27.8624857|184.2916699|10.0244251|29.4436134|159.9398479 unknown
InChI: InChI=1S/C15H23NO4S/c1-2-3-4-5-6-7-12-21(19,20)16-14-10-8-13(9-11-14)15(17)18/h8-11,16-17H,2-7,12H2,1H3
charge 0 multiplicity 1
44 atoms
S  0.329222 -1.393637 -0.232508
O  0.009121 -2.952732 -0.590811
O  0.702965 -0.932864 1.282197
O  6.708325 2.054049 1.462827
O  7.898457 0.411146 0.330632
N  1.743249 -0.758012 -1.506193
C  -3.597044 0.230268 -0.536809
C  -4.895591 -0.087099 0.240587
C  -2.407834 -0.645564 -0.062521
C  -6.09153 0.784832 -0.203398
C  -1.143982 -0.309037 -0.852157
C  -7.393117 0.467814 0.567435
C  -8.58877 1.345456 0.131726
C  -9.886211 1.020698 0.903146
C  2.979824 -0.380857 -0.927363
C  4.1863 -1.065134 -1.26651
C  3.033742 0.737836 -0.04592
C  5.418585 -0.609522 -0.774773
C  4.266188 1.170931 0.466592
C  5.469086 0.50904 0.09956
C  6.793836 0.942436 0.60595
H  -3.770399 0.071623 -1.620921
H  -3.345506 1.302938 -0.408159
H  -5.15082 -1.158356 0.106167
H  -4.7178 0.058341 1.326021
H  -2.232127 -0.475814 1.016997
H  -2.658596 -1.715298 -0.194766
H  -6.267068 0.643853 -1.290521
H  -5.836926 1.856512 -0.06511
H  -1.20262 -0.553613 -1.924985
H  -0.773655 0.717577 -0.701918
H  -7.218618 0.602746 1.655437
H  -7.653868 -0.601782 0.425054
H  -8.328243 2.413836 0.277096
H  -8.760881 1.212741 -0.956067
H  1.831914 -1.589402 -2.124529
H  -10.185824 -0.033125 0.748795
H  -9.749923 1.173836 1.990435
H  -10.724639 1.661808 0.574328
H  4.145014 -1.942817 -1.922986
H  2.108405 1.252899 0.226069
H  6.353963 -1.113112 -1.038872
H  4.31571 2.025847 1.145944
H  7.624984 2.288811 1.768702
