program: Gaussian 09
title: 000227298
version: EM64L-G09RevD.01
frameworkgroup: C1[X(C11H11BrN4O2S)]
method: RPBEPBE
basis: SDD
operation: Freq
keyword: #p
keyword: freq=noraman
keyword: PBEPBE/SDD
title: #p freq=noraman PBEPBE/SDD
converged: YES YES NO NO
title: Mulliken charges:
elementType: Br S O O N N N N C C C C C C C C C C C H H H H H H H H H H H
charge: 0.016446 0.987123 -0.540392 -0.490271 -0.603787 -0.078646 -0.042908 -0.686905 -0.089259 -0.224519 -0.147907 0.075394 0.517265 -0.389808 -0.408087 0.286906 -0.240675 -0.213327 -0.772104 0.360737 0.284332 0.284879 0.232156 0.231451 0.257873 0.258566 0.250351 0.253090 0.315809 0.316218
chargesum: 0.00000
title: Mulliken charges with hydrogens summed into heavy atoms:
elementType: Br S O O N N N N C C C C C C C C C C C
charge: 0.016446 0.987123 -0.540392 -0.490271 -0.243050 -0.078646 -0.042908 -0.054878 -0.089259 0.059813 0.136972 0.075394 0.517265 -0.157652 -0.176636 0.286906 -0.240675 0.044546 -0.010097
polarizability: 2.90984796e+02 -4.02019598e+00 2.12723666e+02 1.70064904e+01 1.56288311e+01 1.30761966e+02
1716.lowfreq: -8.3797 -2.4617 -0.0017 0.0005 0.0006 4.5783 15.5515 30.4188 46.9713
frequency: 15.4903 30.4038 46.9592 50.2337 80.1357 104.5097 112.8290 136.3862 147.1858 185.5880 191.7195 201.1846 230.7278 237.9106 281.7347 295.6410 298.3844 331.7333 384.3836 404.7548 410.7133 411.4013 415.1491 436.3668 440.4885 459.4256 521.0681 528.1300 543.8486 600.7754 609.2875 622.3351 645.3231 689.9576 719.8920 770.0764 784.4858 802.3254 811.0161 817.9113 834.0033 905.8576 929.8291 948.5699 953.7779 965.3409 980.6403 998.4838 1012.0561 1023.1878 1043.2748 1050.1987 1133.7721 1185.7510 1189.5824 1234.5767 1273.4386 1303.0355 1304.3749 1324.2666 1387.8276 1397.5602 1401.2891 1424.6571 1436.8489 1455.1985 1458.2148 1490.2348 1502.1664 1526.1993 1585.8190 1613.7779 1649.5593 2991.9604 3070.0901 3128.1654 3135.9443 3138.5155 3154.0235 3165.4431 3180.7071 3506.2213 3561.6690 3700.3316
redmass: 7.4414 4.5903 4.0430 11.1830 6.9617 3.4415 1.2399 7.4089 6.1942 5.7550 14.1973 4.3486 7.3448 7.8690 7.7712 8.4953 8.9168 6.0708 4.2236 3.4576 1.1124 6.7041 2.5233 1.3472 3.5107 5.0639 2.7530 1.8734 3.6787 6.2638 3.8950 6.9066 8.4038 2.7174 2.8973 5.7520 9.2459 5.8941 1.2942 8.5521 1.8481 4.1965 1.4385 1.4362 6.4515 1.4174 5.1495 5.3149 1.8291 1.4583 1.5779 2.5168 1.1979 1.1639 2.5719 2.6350 4.4274 1.4685 1.5848 2.5699 1.5539 1.8279 5.4788 3.1109 3.7956 1.3771 1.0458 2.8991 8.7136 4.9736 7.3626 4.8220 1.2238 1.0381 1.0965 1.0993 1.0895 1.0900 1.0936 1.0959 1.0952 1.0773 1.0453 1.1040
irintensity: 1.4268 1.5301 0.3406 0.1166 0.8821 0.5574 0.4152 0.8004 2.5510 1.9912 1.6176 1.0557 9.4178 5.3626 1.5734 23.1424 17.2330 3.7064 11.4790 6.8807 2.6826 51.7830 2.7350 215.8528 2.6894 300.8548 45.2467 42.6971 34.8968 13.3152 2.0577 0.7323 65.4346 285.5363 9.0805 7.0423 8.8666 36.8126 1.8954 109.8638 82.6826 7.6672 7.5657 2.9161 53.2115 1.8605 8.9635 49.9833 33.6579 2.5576 7.2834 64.5566 12.5579 61.8491 0.2041 23.4617 8.7318 2.2144 8.5696 71.7703 4.2980 161.7973 5.2703 468.1645 1.6004 275.7326 16.5880 70.1278 113.5146 234.5124 12.3933 179.4789 267.0731 5.0758 8.7286 7.6482 12.9742 13.5496 8.0636 6.6603 5.4049 83.1911 118.4070 25.7273
temp: 298.150 k
press: 1.00000 atm
elementType: 35 16 8 8 7 7 7 7 6 6 6 6 6 6 6 6 6 6 6 1 1 1 1 1 1 1 1 1 1 1
symmnumber: 1
zpe: 553059.4 jmol-1
zpe.correction: 0.210649 hartree
zpe.thermalcorrener: 0.229722 hartree
zpe.thermalcorrenthalpy: 0.230666 hartree
zpe.thermalcorrgfe: 0.160655 hartree
zpe.sumelectzpe: -1205.203100 hartree
zpe.sumelectthermal: -1205.184027 hartree
zpe.sumelectthermalent: -1205.183083 hartree
zpe.sumelectthermalfe: -1205.253094 hartree
dipole: -1.8182 6.6390 -3.4119
dipole: 7.6827
quadrupole: -100.4771 -120.8118 -130.9800
quadrupole: -31.7726 10.3705 6.7818
quadrupole: 16.9458 -3.3888 -13.5570 -31.7726 10.3705 6.7818
hfenergy: -1205.4137489 hartree
pointgroup: C01 [X(C11H11Br1N4O2S1)]
dipole: 0.9711273 -2.8408753 0.3499258 debye
polarizability: 292.8107655|1.0560488|172.813236|-1.1164811|-44.7497998|168.8464266 unknown
InChI: InChI=1S/C11H11BrN4O2S/c1-7-10(12)6-14-11(15-7)16-19(17,18)9-4-2-8(13)3-5-9/h2-6,16H,13H2,1H3
charge 0 multiplicity 1
30 atoms
Br -5.227717 -1.77292 0.687835
S  1.107482 1.667127 -0.380754
O  1.923146 2.479067 -1.530209
O  0.482218 2.424304 0.905915
N  -0.26954 0.949222 -1.43105
N  -2.501364 0.34445 -1.74959
N  -1.336287 -0.206731 0.334691
N  4.530745 -2.967069 1.431416
C  2.11839 0.209296 0.164844
C  3.203951 -0.171474 -0.645514
C  1.805279 -0.424341 1.381126
C  -1.407808 0.350572 -0.918701
C  3.730168 -1.91407 1.009983
C  4.010841 -1.238424 -0.21821
C  2.618846 -1.488051 1.802423
C  -3.633567 -0.287512 -1.316576
C  -3.640048 -0.877778 -0.020775
C  -2.474531 -0.80873 0.771366
C  -4.818281 -0.304064 -2.246042
H  -0.348295 1.448277 -2.326212
H  3.419064 0.370628 -1.57177
H  0.944558 -0.091718 1.967454
H  4.86544 -1.551161 -0.828766
H  2.397876 -1.997295 2.747256
H  -2.447512 -1.24736 1.773873
H  -4.555833 0.215693 -3.179166
H  -5.126983 -1.340311 -2.476345
H  -5.691249 0.192058 -1.783496
H  5.326006 -3.273581 0.87808
H  4.343505 -3.448407 2.306514
