program: Gaussian 09
title: 000227287
version: EM64L-G09RevD.01
frameworkgroup: C1[X(C13H15NO4)]
method: RPBEPBE
basis: SDD
operation: Freq
keyword: #p
keyword: freq=noraman
keyword: PBEPBE/SDD
title: #p freq=noraman PBEPBE/SDD
converged: YES YES NO NO
title: Mulliken charges:
elementType: O O O O N C C C C C C C C C C C C C H H H H H H H H H H H H H H H
charge: -0.250294 -0.230153 -0.238953 -0.275500 -0.409640 -0.260676 0.074022 0.290640 0.308195 -0.328048 -0.343755 0.256424 -0.226345 -0.259117 -0.232340 -0.219109 -0.778146 -0.673585 0.309253 0.346880 0.281171 0.276579 0.240780 0.229272 0.238356 0.236327 0.236565 0.253192 0.249575 0.220464 0.213335 0.231298 0.233335
chargesum: 0.00000
title: Mulliken charges with hydrogens summed into heavy atoms:
elementType: O O O O N C C C C C C C C C C C C C
charge: -0.250294 -0.230153 -0.238953 -0.275500 -0.062761 0.048576 0.074022 0.290640 0.308195 -0.046877 -0.067176 0.256424 0.243707 -0.020761 0.003987 0.017456 -0.054915 0.004382
polarizability: 2.19704410e+02 -1.41536947e+01 1.22717236e+02 4.95346320e+00 -1.93099749e+01 1.44537525e+02
1716.lowfreq: -15.1154 -3.9905 -0.0008 -0.0006 0.0002 4.6717 11.2493 26.3763 41.2834
frequency: -8.1016 26.3304 41.1988 51.0064 59.4022 72.9348 83.8690 88.1997 115.2518 145.3061 164.9658 176.7049 198.8409 239.2162 250.2965 291.4284 338.5211 349.8939 384.4193 400.9223 425.0465 467.4446 485.0494 562.6027 601.9208 610.7106 614.2897 654.9043 676.2417 688.4896 693.6320 727.5280 778.6474 797.9329 800.8092 831.9322 858.5817 910.9422 951.8999 965.3295 968.4813 988.2105 995.2889 998.8793 1011.6243 1023.2926 1029.6301 1043.6306 1092.3646 1112.4727 1131.0540 1136.1898 1160.4007 1175.5574 1199.8249 1204.7421 1251.2956 1261.9357 1274.3975 1321.9221 1335.1314 1356.9960 1388.0112 1389.6614 1399.8876 1437.5013 1450.4159 1458.6401 1462.5466 1472.1351 1477.4276 1483.0190 1484.8698 1561.6366 1590.8841 1607.1219 1610.4878 1627.5935 2997.2534 2998.8060 3014.5312 3025.6244 3075.5627 3093.7265 3096.3064 3106.6920 3110.8988 3132.9931 3145.2424 3155.7686 3165.0821 3173.5254 3480.4149
redmass: 2.8052 3.8608 3.1240 1.7036 2.7331 5.8070 2.4171 5.3304 4.9839 3.8264 5.0776 3.5281 4.0171 4.9531 1.5203 5.2854 5.8039 4.5569 4.1721 2.8234 3.8436 6.7898 4.6085 3.6851 4.7444 5.1927 5.6735 5.0943 1.9589 1.9688 1.9917 3.2877 2.3867 1.2185 2.9758 5.1745 1.2507 4.7650 1.4983 6.1889 2.4149 3.4030 1.6787 1.9066 1.3521 2.4838 2.0410 1.6612 1.6029 2.3298 2.8748 1.6557 3.6714 1.0690 1.1734 1.8130 1.1360 1.8229 2.9007 1.3815 1.3166 1.3811 1.2347 8.2799 1.2664 2.3119 1.1066 1.3002 1.0403 1.0666 1.6885 2.1360 1.0821 7.3822 6.7716 6.1441 6.2315 9.9666 1.0358 1.0358 1.0583 1.0832 1.1065 1.0984 1.0983 1.1006 1.1031 1.0858 1.0888 1.0929 1.0963 1.1011 1.0779
irintensity: 0.2070 0.0899 0.7944 0.9212 7.1771 3.6913 6.0361 5.7362 1.7293 0.2911 0.4979 1.8683 17.1446 0.5472 2.1433 13.7917 3.4183 5.0882 1.6206 0.4030 2.4873 2.2382 54.8940 1.6227 6.8960 4.4237 3.2142 7.6572 86.2908 38.8976 47.7610 16.7501 43.7537 5.1794 2.1588 7.3660 1.4985 34.4866 13.1151 16.7321 33.7476 0.7273 1.5584 28.3797 2.1543 82.6235 4.6505 7.5885 7.9675 28.3003 302.0157 58.1800 40.7212 3.5265 43.1316 115.7682 0.5531 1.6724 138.1056 22.5489 18.0447 2.2912 65.9628 5.2727 29.1192 50.1898 66.3596 189.5347 13.2088 3.6901 222.0915 7.1656 23.1958 152.2499 69.1376 96.2755 5.5287 171.4109 18.3709 10.7136 15.4186 14.5268 4.0952 27.5557 11.2888 14.9824 39.3196 0.7140 10.0304 7.8924 8.5351 26.4097 96.1819
temp: 298.150 k
press: 1.00000 atm
elementType: 8 8 8 8 7 6 6 6 6 6 6 6 6 6 6 6 6 6 1 1 1 1 1 1 1 1 1 1 1 1 1 1 1
symmnumber: 1
zpe: 677865.3 jmol-1
zpe.correction: 0.258185 hartree
zpe.thermalcorrener: 0.275764 hartree
zpe.thermalcorrenthalpy: 0.276708 hartree
zpe.thermalcorrgfe: 0.210687 hartree
zpe.sumelectzpe: -858.718362 hartree
zpe.sumelectthermal: -858.700784 hartree
zpe.sumelectthermalent: -858.699840 hartree
zpe.sumelectthermalfe: -858.765861 hartree
dipole: -1.8771 0.7631 2.3561
dipole: 3.1076
quadrupole: -85.5182 -98.4781 -112.7294
quadrupole: 0.3960 10.6640 1.4599
quadrupole: 13.3903 0.4305 -13.8208 0.3960 10.6640 1.4599
hfenergy: -858.9765477 hartree
pointgroup: C01 [X(C13H15N1O4)]
dipole: 0.4203262 0.6526043 -0.9445748 debye
polarizability: 191.3172546|48.4077194|147.1530614|-5.933287|13.3012054|148.4888557 unknown
InChI: InChI=1S/C13H15NO4/c1-3-18-13(17)11(14-9(2)15)12(16)10-7-5-4-6-8-10/h4-8,11,14H,3H2,1-2H3
charge 0 multiplicity 1
33 atoms
O  -2.280598 0.262048 -0.011105
O  0.581482 -1.044612 -1.928239
O  -0.905288 0.9273 1.746072
O  -2.12428 -2.46372 1.835473
N  -0.99599 -2.157867 -0.158565
C  -0.251199 -1.019213 0.351173
C  0.741277 -0.569156 -0.763831
C  1.855465 0.362518 -0.439784
C  -1.166892 0.156381 0.796213
C  2.102431 0.847002 0.875506
C  2.716855 0.757114 -1.504006
C  -1.916992 -2.815943 0.631138
C  -3.265385 1.328468 0.36956
C  3.194677 1.707163 1.114419
C  3.804206 1.614653 -1.25926
C  4.047299 2.090674 0.05332
C  -2.65627 -3.971009 -0.031049
C  -4.41974 1.229586 -0.620174
H  0.306361 -1.295214 1.265139
H  -0.87674 -2.349895 -1.159796
H  1.438287 0.582154 1.703503
H  2.510476 0.373071 -2.508337
H  -3.577268 1.140695 1.412256
H  -2.746749 2.303338 0.32863
H  3.378579 2.079839 2.127381
H  4.463205 1.912924 -2.081583
H  4.895993 2.756516 0.24611
H  -2.564168 -4.868811 0.603169
H  -3.730637 -3.72389 -0.094703
H  -2.28332 -4.204594 -1.042643
H  -5.178105 1.99844 -0.384709
H  -4.070001 1.391331 -1.653977
H  -4.901072 0.238609 -0.563902
