program: Gaussian 09
title: 000227276
version: EM64L-G09RevD.01
frameworkgroup: C1[X(C17H16O2)]
method: RPBEPBE
basis: SDD
operation: Freq
keyword: #pfreq=noraman
keyword: PBEPBE/SDD
title: #p freq=noraman PBEPBE/SDD
converged: NO YES NO NO
title: Mulliken charges:
elementType: O O C C C C C C C C C C C C C C C C C H H H H H H H H H H H H H H H H
charge: -0.289478 -0.260201 0.524657 0.218527 -0.390186 -0.403890 -0.364646 -0.352562 -0.328690 0.493635 -0.313113 0.174299 -0.389080 -0.402822 -0.236222 -0.237547 -0.219957 -0.242276 -0.675119 0.226180 0.228704 0.268552 0.269261 0.218397 0.216124 0.223498 0.228089 0.226824 0.228632 0.228895 0.229247 0.231338 0.212090 0.229465 0.229374
chargesum: 0.00000
title: Mulliken charges with hydrogens summed into heavy atoms:
elementType: O O C C C C C C C C C C C C C C C C C
charge: -0.289478 -0.260201 0.524657 0.218527 -0.164006 -0.175186 -0.096094 -0.083302 -0.110293 0.493635 -0.096989 0.174299 -0.165581 -0.174733 -0.009399 -0.008915 0.238185 -0.010937 -0.004190
polarizability: 4.71135670e+02 2.23481680e+00 1.83356966e+02 -7.14864240e-02 1.54140399e-01 8.27881686e+01
1716.lowfreq: -5.7676 -0.0007 -0.0005 0.0008 3.2538 12.7069 21.8010 33.1111 46.5347
frequency: 21.7843 33.1109 46.5061 47.2039 73.3882 85.9734 99.7262 109.2842 161.4883 167.7880 224.7674 241.8433 254.6770 282.8182 325.7318 331.0978 381.9516 403.1077 409.1600 453.7452 474.0758 495.7596 534.2062 576.3802 615.1646 632.6931 659.7764 678.7671 694.5125 751.6101 776.3745 786.6425 799.0625 818.8910 842.6128 844.6534 848.6286 855.9938 866.7589 896.9534 926.4450 976.1028 978.0581 987.6169 991.6545 997.1488 1000.5685 1005.5153 1022.5018 1026.0839 1062.9820 1084.2948 1112.5691 1119.4516 1135.4501 1173.3406 1187.1955 1192.8944 1202.7307 1241.2504 1248.0906 1256.9517 1291.7881 1303.5409 1324.3440 1340.9001 1359.4602 1381.5110 1391.8578 1401.3823 1422.3847 1440.8914 1462.8193 1473.5823 1482.8223 1486.5555 1503.4435 1561.4358 1581.7118 1603.2449 1611.4309 1617.4176 1644.7563 2995.4776 3011.2168 3069.2615 3091.9445 3092.0119 3102.5006 3106.4717 3119.4102 3126.3100 3127.3381 3139.9375 3140.5892 3150.3097 3162.9939 3166.4270 3175.4681
redmass: 4.0696 4.6216 2.9483 4.4484 3.3116 5.3052 4.1807 2.6755 6.3157 2.6641 5.0878 1.4336 2.2584 4.9246 4.6030 4.5033 5.1316 2.7825 2.8338 4.8456 2.8484 4.8245 3.1246 6.6660 6.4482 7.0824 6.5635 4.0537 1.7047 2.3672 2.4294 5.7867 1.1048 4.9188 1.3650 4.2647 1.3052 1.4784 4.2183 1.7805 1.6514 1.2490 1.3507 6.1351 1.3488 1.3543 1.2864 3.3363 2.2612 2.2059 5.1778 1.6344 2.2025 1.4623 1.4671 1.0638 1.1750 1.1200 2.6967 1.6111 1.1334 2.3208 2.4400 1.4382 1.4366 1.2819 1.4197 5.2233 4.4498 1.2720 3.8735 2.2838 1.0405 1.0636 2.1872 1.0860 2.6612 7.0334 5.6013 5.8217 9.2232 6.5233 5.4804 1.0358 1.0582 1.1064 1.0920 1.0983 1.0859 1.1027 1.0869 1.0896 1.0860 1.0911 1.0873 1.0960 1.0962 1.1015 1.0948
irintensity: 0.3405 0.0006 0.0097 0.0683 0.7847 0.5581 1.0100 1.9953 0.1722 3.1480 6.4063 0.6046 0.5507 3.7424 0.3233 6.2389 16.6758 0.0179 0.0122 0.1224 0.1427 4.0206 21.8530 7.6070 0.0656 1.3800 1.8348 24.4166 65.9261 3.5679 42.3605 4.2505 1.5969 0.6465 7.4760 6.0833 6.9786 26.7739 1.5090 9.5793 0.1017 32.4751 15.6578 0.2881 5.5648 2.9023 10.7570 30.5061 37.3269 9.2081 490.9622 8.5753 3.8800 6.1254 5.6532 0.2662 158.0256 12.3212 4.0512 255.5002 0.0012 281.6996 4.8375 2.2345 2.7289 5.4691 9.3449 7.6353 0.5297 20.7848 19.8509 10.5360 12.0937 6.2818 7.7179 17.4347 13.7153 28.0055 9.0033 121.0422 299.0582 68.0327 2.7455 25.5695 25.5272 7.1378 1.6989 34.6990 38.4892 47.2243 11.2400 16.5686 1.7904 6.8871 4.9448 41.1819 7.8914 39.8911 2.7904
temp: 298.150 k
press: 1.00000 atm
elementType: 8 8 6 6 6 6 6 6 6 6 6 6 6 6 6 6 6 6 6 1 1 1 1 1 1 1 1 1 1 1 1 1 1 1 1
symmnumber: 1
zpe: 735694.5 jmol-1
zpe.correction: 0.280211 hartree
zpe.thermalcorrener: 0.297689 hartree
zpe.thermalcorrenthalpy: 0.298633 hartree
zpe.thermalcorrgfe: 0.232265 hartree
zpe.sumelectzpe: -806.519131 hartree
zpe.sumelectthermal: -806.501654 hartree
zpe.sumelectthermalent: -806.500709 hartree
zpe.sumelectthermalfe: -806.567077 hartree
dipole: -1.3988 -2.0881 0.0002
dipole: 2.5134
quadrupole: -87.3438 -104.6132 -118.1543
quadrupole: -11.3674 0.0097 0.0591
quadrupole: 16.0266 -1.2427 -14.7839 -11.3674 0.0097 0.0591
hfenergy: -806.7993421 hartree
pointgroup: C01 [X(C17H16O2)]
dipole: -0.5575448 -0.8146657 -0.0569631 debye
polarizability: 471.0854079|-0.6319866|182.9509|5.0819434|6.2423235|83.2444967 unknown
InChI: InChI=1S/C17H16O2/c1-2-19-17(18)16-12-10-15(11-13-16)9-8-14-6-4-3-5-7-14/h3-13H,2H2,1H3
charge 0 multiplicity 1
35 atoms
O  5.030304 -0.495847 0.084103
O  4.728977 1.813384 0.218837
C  -0.035004 -0.146598 0.036069
C  2.78372 0.344411 0.104968
C  0.478415 1.183948 0.12435
C  0.905937 -1.218506 -0.016306
C  1.859978 1.423979 0.158085
C  2.2916 -0.983509 0.017282
C  -1.468749 -0.463819 -0.003541
C  -3.943964 0.120092 0.006135
C  -2.506777 0.431386 0.045422
C  4.237552 0.657576 0.143084
C  -4.459489 -1.207261 -0.085246
C  -4.877777 1.195937 0.061822
C  -5.847495 -1.44203 -0.121111
C  -6.267945 0.961558 0.026106
C  6.507488 -0.265807 0.115573
C  -6.761116 -0.360281 -0.066182
C  7.167984 -1.638811 0.055047
H  -0.20827 2.035785 0.166263
H  0.53392 -2.248194 -0.084281
H  2.254732 2.443174 0.225638
H  3.001109 -1.814333 -0.023764
H  -1.700274 -1.5355 -0.080772
H  -2.273173 1.503018 0.121568
H  -3.774223 -2.060924 -0.127507
H  -4.50187 2.224357 0.133543
H  -6.223322 -2.468997 -0.191544
H  -6.965057 1.805607 0.070033
H  6.776592 0.373694 -0.744463
H  6.752678 0.28396 1.04216
H  -7.840099 -0.547491 -0.094439
H  8.267317 -1.526146 0.075029
H  6.867427 -2.260327 0.915978
H  6.890874 -2.170186 -0.871642
