program: Gaussian 09
title: 000227273
version: EM64L-G09RevD.01
frameworkgroup: C1[X(C8H14ClNO3)]
method: RPBEPBE
basis: SDD
operation: Freq
keyword: #p
keyword: freq=noraman
keyword: PBEPBE/SDD
title: #p freq=noraman PBEPBE/SDD
converged: YES YES NO NO
title: Mulliken charges:
elementType: Cl O O O N C C C C C C C C H H H H H H H H H H H H H H
charge: -0.010673 -0.393314 -0.242042 -0.241956 -0.171545 -0.057683 -0.123993 -0.694689 -0.704554 0.156393 -0.667462 0.319596 -0.719553 0.220226 0.300062 0.218446 0.213937 0.229505 0.220376 0.218835 0.230335 0.290532 0.237472 0.232496 0.281301 0.278806 0.379144
chargesum: 0.00000
title: Mulliken charges with hydrogens summed into heavy atoms:
elementType: Cl O O O N C C C C C C C C
charge: -0.010673 -0.014170 -0.242042 -0.241956 -0.171545 0.162543 0.176069 -0.032801 -0.035007 0.156393 0.093038 0.319596 -0.159447
polarizability: 1.34454460e+02 -5.07618371e+00 9.51921008e+01 5.79556195e+00 -1.68604678e+00 1.04342962e+02
1716.lowfreq: -0.0024 -0.0017 -0.0013 6.2088 8.1484 14.2310 29.1414 35.3186 58.3126
frequency: 28.8949 35.0594 58.3047 69.8059 92.1144 119.6366 137.4919 156.5197 196.0607 200.7964 211.9664 236.1359 262.9032 295.5698 310.1234 331.6076 362.5864 401.7787 421.8210 522.8861 546.6719 585.1434 613.2708 640.7094 712.2508 752.9102 807.0563 840.4365 878.3863 921.9110 924.2143 946.8428 962.6775 984.8620 1056.3725 1090.3698 1110.8472 1133.1513 1145.2966 1160.0838 1174.2172 1201.6152 1242.3025 1254.1920 1299.1159 1313.0565 1327.7046 1355.1845 1381.6185 1383.3991 1400.6228 1424.8145 1447.9703 1465.6555 1469.1159 1481.8081 1485.7273 1487.7037 1500.6676 1612.6617 1643.4823 2966.3298 2978.2973 2982.9610 2984.7217 3036.0822 3060.8499 3062.9412 3073.3522 3077.9783 3080.5430 3083.7665 3104.1807 3112.7223 3489.6056
redmass: 7.8827 6.0707 8.2033 2.5920 2.6633 5.3645 4.3321 2.1820 1.4947 1.1036 2.0083 1.6061 3.7113 5.2800 3.3174 3.4623 5.0237 2.5943 2.6387 3.3555 3.9714 4.1909 2.0028 2.5777 3.7419 6.8022 4.3234 2.5964 3.3511 1.6308 1.3398 1.8856 1.8334 2.6126 2.1800 1.8504 1.3289 2.4153 2.2402 1.0910 1.8331 3.2351 1.5948 1.5025 1.5912 1.4528 1.8283 1.5209 1.4093 1.5056 1.2067 1.0893 1.1655 1.0549 1.0444 1.0603 1.0743 1.0491 1.0467 9.9054 7.6466 1.0420 1.0355 1.0360 1.0830 1.0570 1.0852 1.0935 1.1001 1.1000 1.0987 1.0991 1.1001 1.1071 1.0638
irintensity: 3.3791 3.0790 1.9476 0.7549 6.2176 2.6320 0.3177 0.2085 1.6524 0.1529 1.3384 2.2574 0.6021 1.7369 4.6267 3.5483 3.4817 2.8253 1.0523 14.2275 3.0710 29.0437 79.7901 79.4346 36.3200 36.7843 2.9735 5.2574 2.8752 2.8183 4.5445 22.2850 18.2775 41.2379 211.8552 64.5456 3.4531 10.0128 58.8091 1.9240 7.6816 10.7216 21.9041 52.2455 23.0535 10.5155 62.9250 30.6640 24.6372 15.4383 13.2266 15.8582 13.0330 3.0428 6.9403 22.1902 20.3399 37.1383 20.9614 237.0617 132.4537 47.2236 29.0028 18.1925 17.0040 12.5929 17.4804 25.9240 23.2406 4.8904 48.3098 52.3783 4.6603 3.4641 23.1535
temp: 298.150 k
press: 1.00000 atm
elementType: 17 8 8 8 7 6 6 6 6 6 6 6 6 1 1 1 1 1 1 1 1 1 1 1 1 1 1
symmnumber: 1
zpe: 566506.5 jmol-1
zpe.correction: 0.215771 hartree
zpe.thermalcorrener: 0.231317 hartree
zpe.thermalcorrenthalpy: 0.232262 hartree
zpe.thermalcorrgfe: 0.171451 hartree
zpe.sumelectzpe: -1052.702449 hartree
zpe.sumelectthermal: -1052.686902 hartree
zpe.sumelectthermalent: -1052.685958 hartree
zpe.sumelectthermalfe: -1052.746769 hartree
dipole: 2.8630 -0.2482 3.3999
dipole: 4.4518
quadrupole: -92.6390 -79.2646 -88.2776
quadrupole: 2.4883 -12.6309 3.5267
quadrupole: -5.9119 7.4625 -1.5505 2.4883 -12.6309 3.5267
hfenergy: -1052.9182199 hartree
pointgroup: C01 [X(C8H14Cl1N1O3)]
dipole: 1.0752494 -0.1036872 1.3786542 debye
polarizability: 133.9696525|-5.0617501|95.2135019|6.8898219|-1.9175456|104.8063689 unknown
InChI: InChI=1S/C8H14ClNO3/c1-5(2)7(8(12)13)10(3)6(11)4-9/h5,7,12H,4H2,1-3H3
charge 0 multiplicity 1
27 atoms
Cl -4.42044 0.136177 -0.510357
O  1.924951 -1.767504 -1.320473
O  2.196492 -1.641609 0.977766
O  -1.591409 0.201906 -1.526047
N  -0.45203 -0.146979 0.486655
C  1.6120 1.338331 0.347668
C  0.849336 0.090284 -0.19605
C  0.722576 2.597417 0.242396
C  2.935977 1.531768 -0.430048
C  1.712892 -1.170126 -0.079526
C  -0.466191 -0.353766 1.950916
C  -1.613823 -0.041479 -0.288094
C  -2.916837 -0.269632 0.502421
H  1.862526 1.154991 1.412643
H  0.604105 0.243985 -1.260685
H  1.258704 3.478196 0.639774
H  -0.219112 2.488876 0.809901
H  0.456121 2.804512 -0.810422
H  2.74244 1.672658 -1.509894
H  3.465434 2.428244 -0.060679
H  3.619029 0.670807 -0.311764
H  0.520085 -0.729123 2.265855
H  -1.210703 -1.115968 2.236202
H  -0.685314 0.582687 2.501425
H  -3.017845 -1.328142 0.793647
H  -2.969004 0.364247 1.401026
H  2.486039 -2.584458 -1.208955
