program: Gaussian 09
title: 000227270
version: EM64L-G09RevD.01
frameworkgroup: C1[X(C20H19NO5)]
method: RPBEPBE
basis: SDD
operation: Freq
keyword: #p
keyword: freq=noraman
keyword: PBEPBE/SDD
title: #p freq=noraman PBEPBE/SDD
converged: YES YES NO NO
title: Mulliken charges:
elementType: O O O O O N C C C C C C C C C C C C C C C C C C C C H H H H H H H H H H H H H H H H H H H
charge: -0.253792 -0.269327 -0.239695 -0.237760 -0.232406 -0.455448 -0.652972 0.409735 0.223038 -0.384418 -0.396153 0.231083 -0.220392 -0.224854 -0.237798 0.203640 -0.165624 0.210974 -0.335323 -0.335346 0.199998 -0.218041 -0.225177 -0.220341 -0.218201 -0.678924 0.251692 0.249219 0.242514 0.246475 0.340228 0.231188 0.231356 0.232958 0.279431 0.266749 0.311056 0.224385 0.239535 0.235411 0.237157 0.234347 0.211399 0.233892 0.224529
chargesum: 0.00000
title: Mulliken charges with hydrogens summed into heavy atoms:
elementType: O O O O O N C C C C C C C C C C C C C C C C C C C C
charge: -0.253792 -0.269327 -0.239695 -0.237760 -0.232406 -0.115220 -0.152062 0.409735 0.223038 -0.141903 -0.149678 0.231083 0.010796 0.006502 -0.004840 0.203640 0.113807 0.210974 -0.068573 -0.024291 0.199998 0.245880 0.010235 0.016815 0.016147 -0.009103
polarizability: 3.35916256e+02 1.13161138e+01 2.74773342e+02 6.59958278e-01 -5.92635915e+00 1.61874849e+02
1716.lowfreq: -0.0004 0.0002 0.0004 3.4016 5.2306 7.6341 15.7435 23.8675 26.0886
frequency: 15.3895 23.7293 25.9476 28.4506 34.4824 46.3293 49.5231 55.6679 63.6226 75.8311 91.1796 111.7671 125.9420 162.4157 170.0883 180.0864 189.5096 232.6447 255.1681 280.6796 298.4702 320.0754 328.5850 345.1615 366.2637 391.4080 402.8833 404.4304 417.8913 441.0896 467.9212 497.9253 534.4599 558.1886 573.4216 597.7359 608.6820 612.8218 617.7360 660.7529 673.7524 686.3410 701.9153 706.8359 735.5833 765.9822 794.6814 800.5108 803.9936 816.4662 836.1399 858.5368 869.6849 875.7800 885.0385 920.2636 925.0697 930.9674 963.1646 976.3560 980.9427 988.5984 989.6456 998.8510 1001.7325 1016.6656 1027.2065 1028.1642 1030.6012 1081.9308 1087.3910 1089.9492 1113.0585 1136.8016 1153.1386 1167.3060 1174.7628 1175.6157 1189.0526 1190.2609 1192.0041 1215.2496 1229.2317 1253.0523 1266.3121 1289.7222 1323.7996 1328.6376 1328.9430 1365.8132 1380.1453 1391.5817 1399.1714 1439.9309 1440.2920 1448.4289 1463.3697 1464.7476 1473.0392 1479.0687 1484.1640 1486.0270 1584.8660 1590.5401 1610.0345 1610.6120 1611.8602 1621.7669 1645.2285 1657.7123 2994.3921 3004.3639 3009.1431 3068.5246 3069.3938 3091.0964 3106.1768 3120.0708 3122.5885 3132.3882 3135.6874 3137.1784 3145.0650 3148.6961 3155.2371 3165.4264 3166.5328 3173.8927 3506.0846
redmass: 4.9987 6.5959 4.8172 4.1927 4.7270 4.1208 4.2813 5.7916 4.1374 3.4335 4.7179 7.0059 5.3766 3.4968 4.7624 4.5563 5.7507 6.4455 1.3371 6.6581 5.8760 2.5444 3.5466 6.5705 3.4966 6.4096 2.8272 2.8480 6.3192 3.8147 4.4590 7.1772 4.5493 4.5891 1.2198 4.8344 4.9208 6.4299 6.4146 6.5852 5.3725 6.1492 1.6675 1.8263 4.7316 2.3389 2.0590 1.3896 2.5475 5.4317 4.2200 1.2504 1.2453 3.9309 1.7257 2.0575 2.0119 2.3284 1.4063 7.3862 1.3858 6.1338 6.2865 1.3123 1.3741 1.3375 2.2050 2.3669 2.1372 1.6003 2.4182 3.0903 2.2527 1.4752 6.5435 1.3791 1.0877 1.0640 1.2846 1.1327 1.6514 2.4112 3.2229 1.1327 1.7725 1.5530 1.3025 1.4798 1.6235 1.5959 8.1373 9.4777 1.2853 2.2663 2.1782 1.1742 1.2543 1.3050 1.0679 2.2234 2.2941 1.0692 6.2135 5.9978 8.2398 6.3384 7.5189 7.7277 10.0981 9.1107 1.0356 1.0629 1.0582 1.1062 1.0978 1.0985 1.1028 1.0875 1.0874 1.0858 1.0925 1.0910 1.0889 1.0959 1.0934 1.0971 1.1015 1.1013 1.0774
irintensity: 0.1369 1.2805 0.4849 0.2289 1.2473 0.2044 1.6255 3.4523 1.5356 1.3764 6.8039 0.2124 2.0976 0.8449 1.6732 0.1423 3.9988 4.9908 0.8908 11.0880 11.9015 0.6336 4.9706 3.0117 6.7862 5.1355 0.0276 0.0255 5.6963 0.3623 10.2607 4.1433 2.5654 32.3068 55.8729 6.5817 6.1715 1.0493 1.2061 10.4662 18.4214 7.1528 83.6747 55.3058 67.8762 7.7980 30.8579 4.1967 10.9357 6.5303 11.6161 0.2715 0.1277 19.8919 18.7646 11.4700 4.9475 12.0768 4.7403 447.0242 0.4101 1.7665 1.3642 1.0673 0.0175 1.0145 8.8787 53.9228 6.4288 10.0400 402.2128 476.9865 14.2542 3.2659 177.1586 44.2567 6.4820 1.1741 8.8345 33.3661 59.9627 1.7597 441.6102 0.0477 8.4698 16.8572 2.2422 77.5550 131.1734 45.5394 0.3250 3.8708 14.0968 18.7627 8.1107 115.0124 139.2982 86.1694 9.9696 13.2953 24.6685 13.8535 11.8605 2.4757 7.6744 89.5421 114.9764 221.9791 120.1052 139.4945 23.9272 11.4261 18.5544 5.0545 3.6834 33.6903 40.3994 6.0065 4.0883 0.6295 37.6703 7.4464 10.8641 32.8247 10.7898 6.1246 19.9549 32.3994 75.5161
temp: 298.150 k
press: 1.00000 atm
elementType: 8 8 8 8 8 7 6 6 6 6 6 6 6 6 6 6 6 6 6 6 6 6 6 6 6 6 1 1 1 1 1 1 1 1 1 1 1 1 1 1 1 1 1 1 1
symmnumber: 1
zpe: 911197.9 jmol-1
zpe.correction: 0.347057 hartree
zpe.thermalcorrener: 0.371874 hartree
zpe.thermalcorrenthalpy: 0.372819 hartree
zpe.thermalcorrgfe: 0.287307 hartree
zpe.sumelectzpe: -1202.539594 hartree
zpe.sumelectthermal: -1202.514776 hartree
zpe.sumelectthermalent: -1202.513832 hartree
zpe.sumelectthermalfe: -1202.599344 hartree
dipole: 0.6680 -0.8991 3.4646
dipole: 3.6411
quadrupole: -119.1408 -139.6460 -154.1782
quadrupole: -4.6174 2.4909 8.0327
quadrupole: 18.5142 -1.9910 -16.5232 -4.6174 2.4909 8.0327
hfenergy: -1202.8866507 hartree
pointgroup: C01 [X(C20H19N1O5)]
dipole: 0.2539078 0.0313885 -1.4095009 debye
polarizability: 334.7194992|-14.586877|267.8976895|-0.7761376|-29.6282475|169.9472582 unknown
InChI: InChI=1S/C20H19NO5/c1-2-25-20(24)17(14-26-19(23)16-11-7-4-8-12-16)21-18(22)13-15-9-5-3-6-10-15/h3-12,14,21H,2,13H2,1H3
charge 0 multiplicity 1
45 atoms
O  -2.022957 0.54035 -0.086452
O  0.66532 -2.64168 -0.027581
O  2.00739 -1.239002 2.243196
O  -1.43524 -2.078782 0.81944
O  -2.384334 2.823762 -0.504037
N  1.593786 -0.085366 0.261146
C  3.9489 -0.387505 1.002773
C  4.329814 0.660167 -0.02972
C  2.437238 -0.602151 1.241149
C  4.4642 2.02502 0.339501
C  4.537038 0.302493 -1.388752
C  0.187455 -0.326733 0.250302
C  4.795662 3.005584 -0.622134
C  4.868031 1.281403 -2.353902
C  4.997626 2.637111 -1.97325
C  -0.304214 -1.733639 0.401635
C  -0.654546 0.733171 0.060788
C  -4.279866 1.271494 -0.349608
C  -5.252986 2.252835 -0.679355
C  -4.677073 -0.05698 -0.033836
C  -2.857891 1.679732 -0.334724
C  0.341148 -4.080164 0.20581
C  -6.617967 1.906461 -0.700371
C  -6.046558 -0.392542 -0.054911
C  -7.016304 0.583318 -0.389027
C  1.545803 -4.885359 -0.269374
H  4.377101 -0.153111 1.993006
H  4.347622 -1.379954 0.717056
H  4.312779 2.316682 1.386063
H  4.44765 -0.749218 -1.688321
H  2.015393 0.461553 -0.494641
H  4.899239 4.053341 -0.318773
H  5.029336 0.986137 -3.396672
H  5.257194 3.396764 -2.718683
H  -0.299659 1.768519 -0.013208
H  -4.921012 3.270161 -0.912271
H  -3.915454 -0.797751 0.229205
H  -0.58196 -4.325624 -0.3505
H  0.142106 -4.212318 1.284468
H  -7.369928 2.660454 -0.955869
H  -6.358541 -1.412903 0.191356
H  -8.07876 0.315268 -0.404163
H  1.358151 -5.963946 -0.116957
H  2.449488 -4.606573 0.29902
H  1.737879 -4.714882 -1.342823
