program: Gaussian 09
title: 000227268
version: EM64L-G09RevD.01
frameworkgroup: C1[X(C9H12N2O3S)]
method: RPBEPBE
basis: SDD
operation: Freq
keyword: #p
keyword: freq=noraman
keyword: PBEPBE/SDD
title: #p freq=noraman PBEPBE/SDD
converged: YES YES NO NO
title: Mulliken charges:
elementType: S O O O N N C C C C C C C C C H H H H H H H H H H H H
charge: 0.936133 -0.530664 -0.516422 -0.298155 -0.472913 -0.592917 -0.220215 -0.066443 -0.662504 0.262824 -0.278253 -0.224253 -0.202773 -0.217190 -0.213945 0.271780 0.320706 0.216471 0.254345 0.231988 0.297926 0.314712 0.243354 0.243941 0.237752 0.327719 0.336993
chargesum: 0.00000
title: Mulliken charges with hydrogens summed into heavy atoms:
elementType: S O O O N N C C C C C C C C C
charge: 0.936133 -0.530664 -0.516422 -0.298155 -0.152207 0.071795 0.051565 -0.066443 0.040301 0.262824 0.019674 0.090459 0.040582 0.026751 0.023807
polarizability: 1.94088889e+02 5.56048198e+00 1.43118554e+02 -1.22155007e+01 3.97427262e+00 9.86325239e+01
1716.lowfreq: -17.0187 -8.9319 -2.3424 -0.0022 -0.0019 0.0005 27.6854 39.2322 52.2803
frequency: 27.3987 39.1890 52.2527 60.8711 89.6862 138.7495 146.2136 188.1518 203.7935 219.1946 240.0216 254.0919 267.0363 287.2939 333.8362 387.3656 402.2561 426.5683 472.7716 482.2938 515.9066 525.4724 593.5656 601.6016 609.6356 656.0524 687.5126 717.1927 744.3896 759.9100 799.4330 849.4937 863.2363 918.1520 935.8180 942.4195 976.2430 985.2593 1005.9296 1007.6234 1033.4293 1045.7026 1065.1262 1074.9947 1080.8821 1127.9435 1172.8366 1184.5402 1232.3202 1276.8359 1310.5466 1342.3216 1382.7434 1386.8892 1402.5672 1436.1489 1455.1829 1460.8493 1477.2361 1575.8916 1596.2664 1601.9051 1644.4231 2994.7533 3039.9084 3093.9077 3114.4805 3137.1101 3144.8286 3152.9037 3163.2185 3173.9199 3270.6355 3515.5955 3664.4092
redmass: 3.8764 5.1287 4.2575 5.3416 7.7648 7.0183 4.7604 5.7427 4.8928 1.1439 6.6634 4.5924 4.0286 3.2181 7.0459 7.2894 2.8713 4.5990 4.2196 3.9087 1.2457 4.0585 1.5754 6.4226 2.4857 7.1147 2.4285 4.2052 2.7483 1.4146 5.3899 1.2921 2.1323 1.5684 1.3788 11.1797 5.1042 1.4536 1.3346 4.4587 1.5459 2.0955 3.1612 2.0146 1.6015 2.1678 1.0658 1.1222 1.3453 1.2346 1.2891 2.1677 6.8004 1.2220 1.5352 2.2403 1.9769 1.0519 1.0636 5.6789 1.8556 6.3957 2.2894 1.0348 1.0856 1.1000 1.1008 1.0861 1.0899 1.0925 1.0967 1.1016 1.0725 1.0453 1.1037
irintensity: 0.3671 5.8198 2.6774 14.2587 7.8144 1.7142 5.1264 9.6993 4.6957 1.2077 7.9546 0.1109 4.1521 19.5966 1.3094 28.3138 0.3332 34.0100 12.3446 32.4438 60.9838 87.0509 165.8243 0.2638 42.7528 5.9511 36.8058 31.8212 46.1729 77.8777 69.7766 3.0013 27.8339 9.5131 4.3375 112.4312 1.7171 1.4316 0.1194 1.8649 24.4446 22.4676 1.0696 9.2777 0.7035 62.1658 0.9233 6.3170 20.4822 1.4313 1.8354 92.1144 5.5589 15.8133 17.3273 19.5607 19.7228 21.8576 12.0999 3.0299 38.7750 0.2146 296.1988 25.0920 4.6718 24.3452 12.5928 4.3253 16.9792 1.5549 2.3633 35.3734 28.3184 48.6939 28.2714
temp: 298.150 k
press: 1.00000 atm
elementType: 16 8 8 8 7 7 6 6 6 6 6 6 6 6 6 1 1 1 1 1 1 1 1 1 1 1 1
symmnumber: 1
zpe: 533816.4 jmol-1
zpe.correction: 0.203320 hartree
zpe.thermalcorrener: 0.219175 hartree
zpe.thermalcorrenthalpy: 0.220120 hartree
zpe.thermalcorrgfe: 0.158897 hartree
zpe.sumelectzpe: -1082.103917 hartree
zpe.sumelectthermal: -1082.088061 hartree
zpe.sumelectthermalent: -1082.087117 hartree
zpe.sumelectthermalfe: -1082.148340 hartree
dipole: 0.9583 -3.3667 0.8898
dipole: 3.6118
quadrupole: -61.3696 -104.9215 -100.4037
quadrupole: 2.3289 -7.6984 5.5046
quadrupole: 27.5287 -16.0232 -11.5054 2.3289 -7.6984 5.5046
hfenergy: -1082.3072368 hartree
pointgroup: C01 [X(C9H12N2O3S1)]
dipole: -0.3114702 1.3853415 0.0549618 debye
polarizability: 182.3200066|6.7391072|140.0415536|33.5857502|-9.9310109|113.4784067 unknown
InChI: InChI=1S/C9H12N2O3S/c1-7(9(10)12)11-15(13,14)8-5-3-2-4-6-8/h2-7,11H,10H2,1H3
charge 0 multiplicity 1
27 atoms
S  0.009706 -1.194643 -0.583625
O  -0.276822 -0.847842 -2.157881
O  0.162614 -2.744911 -0.138638
O  -1.455068 2.105567 -0.808828
N  -1.398351 -0.4157 0.439281
N  -2.894388 1.341647 -2.467697
C  -2.542619 -0.063958 -0.442552
C  1.52924 -0.252581 0.047688
C  -3.76612 0.186742 0.475469
C  -2.232307 1.21133 -1.272486
C  2.464338 -0.988223 0.792154
C  1.668447 1.105784 -0.285913
C  3.621332 -0.307374 1.237473
C  2.832583 1.765234 0.173773
C  3.801658 1.061753 0.928782
H  -2.745048 -0.919447 -1.110909
H  -0.988232 0.471942 0.811836
H  -4.663168 0.416835 -0.126963
H  -3.957678 -0.712392 1.082897
H  -3.576145 1.036768 1.154023
H  2.288501 -2.048179 1.003752
H  0.901677 1.631823 -0.865253
H  4.375568 -0.845423 1.820817
H  2.97708 2.82521 -0.058845
H  4.700496 1.582234 1.276858
H  -3.38767 0.556205 -2.889376
H  -2.720225 2.170702 -3.036637
