program: Gaussian 09
title: 000227267
version: EM64L-G09RevD.01
frameworkgroup: C1[X(C11H16O2)]
method: RPBEPBE
basis: SDD
operation: Freq
keyword: #pfreq=noraman
keyword: PBEPBE/SDD
title: #p freq=noraman PBEPBE/SDD
converged: YES YES NO NO
title: Mulliken charges:
elementType: O O C C C C C C C C C C C H H H H H H H H H H H H H H H H
charge: -0.455618 -0.445593 0.362371 -0.164859 -0.207364 -0.534375 -0.175242 -0.507295 -0.786917 -0.215440 -0.208324 -0.212313 -0.206041 0.264787 0.212639 0.216845 0.210137 0.194435 0.216538 0.202400 0.230536 0.230693 0.225427 0.236714 0.232504 0.203354 0.206907 0.339999 0.333096
chargesum: 0.00000
title: Mulliken charges with hydrogens summed into heavy atoms:
elementType: O O C C C C C C C C C C C
charge: -0.115619 -0.112497 0.362371 0.099928 0.005276 -0.107393 0.019193 -0.088356 -0.100262 0.021273 0.024180 -0.008960 0.000865
polarizability: 1.22367639e+02 -3.99710480e-02 1.36387262e+02 -1.49486937e+00 7.04250199e+00 8.60315022e+01
1716.lowfreq: -21.2243 -9.9650 0.0008 0.0009 0.0011 0.6233 71.4265 104.6546 122.2506
frequency: 71.4040 104.6434 122.2282 190.1692 205.8211 223.6634 256.2803 264.5994 272.0408 278.3365 311.8355 333.4191 380.2276 397.7244 423.5443 439.7385 456.6276 496.9499 565.3158 615.0884 666.4742 698.7069 708.7305 765.5078 824.7007 871.9742 887.3381 915.2812 931.3145 954.3099 964.4517 971.1281 978.4926 983.0595 995.5701 1004.9875 1014.3290 1080.7304 1094.9681 1128.0766 1141.5577 1157.6060 1170.5166 1186.5232 1189.0680 1193.2549 1219.6891 1250.6244 1271.6793 1304.2772 1318.0430 1322.4490 1326.6180 1343.8651 1350.1221 1364.1962 1376.3188 1383.5538 1394.6291 1455.4008 1456.9693 1472.9060 1487.3963 1679.6916 1685.4374 2888.4558 2898.7194 2926.5591 2934.6971 2967.5345 2979.5507 2988.6002 2989.7268 3083.4712 3085.6754 3095.4150 3125.7424 3127.4392 3154.0200 3555.0064 3559.1838
redmass: 3.6073 3.3597 2.4179 1.6741 1.9217 3.2359 2.6576 1.1494 2.6078 1.2127 3.3673 3.2105 2.1604 5.3080 4.0237 3.2110 3.2132 3.7053 3.1028 3.0816 1.2841 4.0966 2.4442 2.6576 2.0966 3.1005 2.1974 2.1063 2.5404 2.0397 3.3805 2.0599 1.4507 1.5492 2.1368 2.0337 2.1461 2.2780 2.0160 1.8691 2.2646 1.5743 1.1782 1.1048 1.0911 1.1458 1.2481 1.5113 1.5673 1.3059 1.2897 1.4768 1.5803 1.4309 1.5020 1.6560 1.6221 1.2512 1.9470 1.0702 1.0936 1.0602 1.0549 7.3822 6.8503 1.0815 1.0817 1.0622 1.0625 1.0847 1.0955 1.0372 1.0914 1.1000 1.0984 1.0837 1.0846 1.0996 1.0999 1.0660 1.0660
irintensity: 0.8753 0.2909 1.2923 4.9911 4.8216 10.8782 31.7849 156.7494 36.1566 61.4426 11.9149 2.7032 0.3846 1.0308 5.4464 3.5958 25.6817 6.9650 3.0201 3.3837 49.0313 9.3426 18.3399 10.7049 9.1917 5.0160 4.0535 8.6968 21.1487 3.8234 48.9101 58.0658 20.9494 7.3524 23.6288 4.3335 20.8961 11.5936 7.2605 3.5609 0.9387 5.2946 0.3119 133.4574 6.1073 24.8992 1.3661 1.6010 5.2721 1.9282 3.3032 2.3645 3.2345 10.6760 8.6903 12.1276 0.5570 20.3077 5.9500 14.0242 0.7599 1.4424 10.3357 5.2140 1.5066 39.0720 47.0138 43.4589 36.2201 15.1265 19.7796 13.3159 76.1730 20.5260 21.3715 7.5211 2.5724 66.5441 26.0814 3.9897 4.3691
temp: 298.150 k
press: 1.00000 atm
elementType: 8 8 6 6 6 6 6 6 6 6 6 6 6 1 1 1 1 1 1 1 1 1 1 1 1 1 1 1 1
symmnumber: 1
zpe: 644260.7 jmol-1
zpe.correction: 0.245386 hartree
zpe.thermalcorrener: 0.258120 hartree
zpe.thermalcorrenthalpy: 0.259064 hartree
zpe.thermalcorrgfe: 0.207776 hartree
zpe.sumelectzpe: -578.158282 hartree
zpe.sumelectthermal: -578.145548 hartree
zpe.sumelectthermalent: -578.144604 hartree
zpe.sumelectthermalfe: -578.195892 hartree
dipole: 2.9632 0.1517 0.1251
dipole: 2.9698
quadrupole: -81.5607 -75.7398 -80.4453
quadrupole: -0.0139 -1.6885 7.0768
quadrupole: -2.3121 3.5088 -1.1967 -0.0139 -1.6885 7.0768
hfenergy: -578.4036682 hartree
pointgroup: C01 [X(C11H16O2)]
dipole: -1.1663382 0.044347 -0.0531862 debye
polarizability: 122.376439|-0.1348101|136.1561672|-1.3030192|-7.8347185|86.2537978 unknown
InChI: InChI=1S/C11H16O2/c1-11-7-3-2-4-8(11)9(12)5-6-10(11)13/h2-3,5-6,8-10,12-13H,4,7H2,1H3
charge 0 multiplicity 1
29 atoms
O  1.232092 -2.756305 0.144274
O  1.307156 2.807598 0.405046
C  -0.244896 -0.706898 -0.115806
C  -0.212421 0.821306 0.238234
C  1.021225 -1.347513 0.542109
C  -1.516852 -1.354901 0.514874
C  1.061695 1.522708 -0.300432
C  -1.489072 1.56313 -0.23676
C  -0.250419 -0.945428 -1.647627
C  2.297461 -0.608927 0.213141
C  2.316879 0.701439 -0.13021
C  -2.775598 -0.522933 0.363538
C  -2.765029 0.791734 0.026528
H  -0.165169 0.899727 1.345666
H  0.875322 -1.311963 1.649209
H  -1.343036 -1.544297 1.598219
H  -1.688724 -2.350759 0.054346
H  0.923123 1.743081 -1.385566
H  -1.411513 1.784466 -1.324616
H  -1.553673 2.550501 0.267372
H  0.597043 -0.443357 -2.145984
H  -0.156724 -2.024551 -1.861369
H  -1.191265 -0.582328 -2.098516
H  3.222867 -1.189273 0.309185
H  3.261019 1.226279 -0.318854
H  -3.733457 -1.028038 0.549771
H  -3.713393 1.337135 -0.07384
H  0.487738 -3.302279 0.50409
H  0.582823 3.440844 0.166979
