program: Gaussian 09
title: 000227266
version: EM64L-G09RevD.01
frameworkgroup: C1[X(C12H14O3)]
method: RPBEPBE
basis: SDD
operation: Freq
keyword: #pfreq=noraman
keyword: PBEPBE/SDD
title: #p freq=noraman PBEPBE/SDD
converged: YES YES NO NO
title: Mulliken charges:
elementType: O O O C C C C C C C C C C C C H H H H H H H H H H H H H H
charge: -0.198722 -0.256688 -0.209919 0.201723 -0.274749 -0.501999 -0.484213 0.065003 -0.751337 0.153302 -0.191186 -0.200925 0.241497 -0.422852 -0.500859 0.270795 0.223519 0.246856 0.228112 0.242134 0.228927 0.238018 0.234168 0.205575 0.212577 0.277292 0.234686 0.260225 0.229043
chargesum: 0.00000
title: Mulliken charges with hydrogens summed into heavy atoms:
elementType: O O O C C C C C C C C C C C C
charge: -0.198722 -0.256688 -0.209919 0.201723 -0.003954 -0.031624 -0.013967 0.065003 -0.050224 0.153302 0.014389 0.011651 0.241497 -0.145560 0.223095
polarizability: 1.44320340e+02 -1.34285498e+01 1.53916307e+02 -1.39817903e+00 -3.33143973e+00 1.06426159e+02
1716.lowfreq: -16.9456 -11.4158 -0.0010 -0.0008 -0.0007 5.0734 43.8973 72.1225 77.7089
frequency: 43.7771 72.1167 77.6801 102.4800 139.6370 176.7354 195.0884 216.9196 229.2482 239.4878 270.7158 312.4815 360.2245 369.2340 375.6881 398.1498 420.2136 447.3632 469.8571 491.4124 556.6498 601.4041 666.4026 687.3504 727.9376 763.4005 779.5614 793.3212 874.6179 887.8472 895.7147 933.4099 942.6426 958.5345 970.4199 983.5197 1010.3616 1019.3387 1051.6517 1085.1265 1103.1741 1122.4511 1143.6779 1172.9304 1187.2047 1200.3814 1205.2340 1251.2532 1272.7828 1287.3574 1303.9915 1326.4805 1333.5500 1340.9083 1374.8252 1388.9517 1436.6546 1444.9998 1454.1388 1458.6782 1461.9606 1472.1636 1481.8764 1562.0815 1580.9270 1587.7342 1687.3224 2960.5437 2967.8354 2984.0272 3008.3967 3017.7316 3021.5391 3034.1284 3080.2697 3093.3517 3101.1462 3120.1836 3132.2978 3142.9257 3159.6621
redmass: 4.7979 3.5825 4.4086 3.0582 3.3056 1.3971 2.7980 2.3709 1.6700 1.7612 4.3726 3.3978 3.7707 3.3286 3.0593 4.3901 5.1481 4.9827 7.3949 5.0299 4.5410 2.6321 1.5408 3.8161 4.2769 4.1535 5.2342 2.8418 4.0253 1.5590 2.6281 2.3466 2.7729 1.7587 1.4168 1.6545 3.3746 1.8896 3.4715 2.7968 1.2396 1.7423 1.4243 1.8093 1.2140 1.6303 1.5711 1.6835 1.4043 5.1263 1.8967 1.4957 1.5996 1.7790 1.6215 1.2108 1.1896 1.0902 1.0551 1.0546 1.0828 1.0561 1.0589 10.6193 9.6929 7.4224 6.5279 1.0651 1.0629 1.0350 1.0294 1.0881 1.0957 1.0910 1.1001 1.0997 1.0839 1.1036 1.0997 1.1065 1.0917
irintensity: 5.2175 2.6617 0.7434 1.4777 6.7496 1.1969 1.1151 1.9398 0.4275 0.4456 1.4084 0.9433 8.3709 1.7684 4.4373 4.0457 0.3044 15.7227 1.0069 1.8507 6.6215 7.4291 42.9435 7.1587 7.1924 4.6547 3.1186 8.5713 21.4427 27.0284 1.1574 2.0579 2.1820 17.2793 2.2354 7.6223 64.3138 37.0967 12.7171 4.7811 0.1101 11.8222 2.7713 24.5703 31.6369 132.1602 86.2129 0.8877 1.4685 29.1126 65.3635 18.2131 8.5963 14.6166 0.5012 14.7356 13.9730 17.2366 37.1073 17.6867 10.8558 7.0925 8.0906 54.0194 322.2758 140.6045 7.2191 19.9755 28.1960 25.1095 48.1843 5.8227 3.1382 24.7428 15.5125 22.1765 6.0281 29.7447 54.2792 16.6032 2.0373
temp: 298.150 k
press: 1.00000 atm
elementType: 8 8 8 6 6 6 6 6 6 6 6 6 6 6 6 1 1 1 1 1 1 1 1 1 1 1 1 1 1
symmnumber: 1
zpe: 610487.0 jmol-1
zpe.correction: 0.232522 hartree
zpe.thermalcorrener: 0.246859 hartree
zpe.thermalcorrenthalpy: 0.247804 hartree
zpe.thermalcorrgfe: 0.191696 hartree
zpe.sumelectzpe: -690.181661 hartree
zpe.sumelectthermal: -690.167323 hartree
zpe.sumelectthermalent: -690.166379 hartree
zpe.sumelectthermalfe: -690.222487 hartree
dipole: 1.0682 -3.0388 0.8180
dipole: 3.3233
quadrupole: -78.9953 -104.8305 -84.1743
quadrupole: 1.7257 1.5026 -3.0027
quadrupole: 10.3380 -15.4971 5.1590 1.7257 1.5026 -3.0027
hfenergy: -690.4141829 hartree
pointgroup: C01 [X(C12H14O3)]
dipole: 0.2828062 -1.2334296 0.3290008 debye
polarizability: 141.3849824|-12.0210763|156.7881516|-1.8567247|-3.4409824|106.4896725 unknown
InChI: InChI=1S/C12H14O3/c1-12-6-4-3-5-8(12)9(13)7-10(15-2)11(12)14/h3-4,7-8H,5-6H2,1-2H3
charge 0 multiplicity 1
29 atoms
O  0.861338 -1.998966 -0.040728
O  2.973886 -0.031428 -0.491181
O  -0.267682 3.341822 0.296207
C  -0.621356 -0.277461 0.930455
C  -1.11804 1.043594 0.255403
C  -1.728646 -1.365538 0.909927
C  -1.662733 0.812755 -1.190131
C  0.650556 -0.778624 0.211317
C  -0.224549 -0.000042 2.417706
C  -0.014096 2.101131 0.180817
C  -2.574927 -1.384807 -0.346634
C  -2.548184 -0.410533 -1.289494
C  1.678545 0.279081 -0.124702
C  1.344618 1.620851 -0.108587
C  3.56816 -1.378897 -0.304813
H  -1.942276 1.452893 0.869537
H  -2.386988 -1.220155 1.791273
H  -1.248665 -2.354793 1.04215
H  -0.820162 0.721004 -1.907811
H  -2.219176 1.719015 -1.496348
H  0.074614 -0.938001 2.920049
H  0.60379 0.723317 2.506954
H  -1.097867 0.413403 2.953833
H  -3.241444 -2.248327 -0.473866
H  -3.180505 -0.495433 -2.183405
H  2.113625 2.370891 -0.323408
H  4.639085 -1.216182 -0.498509
H  3.136487 -2.096662 -1.017253
H  3.41249 -1.743808 0.724344
