program: Gaussian 09
title: 000227264
version: EM64L-G09RevD.01
frameworkgroup: C1[X(C12H16N2O4)]
method: RPBEPBE
basis: SDD
operation: Freq
keyword: #p
keyword: freq=noraman
keyword: PBEPBE/SDD
title: #p freq=noraman PBEPBE/SDD
converged: YES YES NO NO
title: Mulliken charges:
elementType: O O O O N N C C C C C C C C C C C C H H H H H H H H H H H H H H H H
charge: -0.512878 -0.475801 -0.495621 -0.454611 -0.419854 -0.236036 -0.118738 -0.168794 -0.173827 0.227189 0.272095 0.063200 -0.332469 -0.569272 -0.357360 0.492282 -0.342873 -0.816841 0.246481 0.263114 0.264591 0.338767 0.197031 0.177797 0.243756 0.385431 0.253943 0.384662 0.357289 0.230824 0.223136 0.231395 0.233296 0.388700
chargesum: 0.00000
title: Mulliken charges with hydrogens summed into heavy atoms:
elementType: O O O O N N C C C C C C C C C C C C
charge: -0.127448 -0.091139 -0.138332 -0.065911 -0.081088 -0.236036 0.127743 0.094319 0.090764 0.227189 0.272095 0.063200 0.042358 -0.325516 -0.103418 0.492282 -0.112049 -0.129014
polarizability: 2.27072028e+02 -4.05100076e+00 1.55179331e+02 -1.12901568e+01 9.95725257e-01 9.78105618e+01
1716.lowfreq: -11.2022 -5.1342 -2.0488 -0.0008 -0.0004 -0.0003 9.7699 36.7794 62.3148
frequency: -8.5875 36.6728 62.3137 69.7889 79.5953 110.5396 118.8337 161.5223 186.6980 204.7079 275.5431 286.5488 291.7911 305.5717 316.9731 325.3421 349.6604 353.9353 426.5794 434.3222 443.9231 470.1478 495.6502 518.9558 536.8962 588.9237 606.5943 614.0581 638.5265 658.0154 727.1302 756.1776 769.0752 776.3018 821.1274 824.4093 854.6654 869.9019 879.8454 930.1704 945.6177 953.4270 961.2606 989.5765 1004.2997 1005.7300 1021.6353 1045.8564 1047.0792 1059.3300 1071.1349 1130.9220 1146.6727 1182.6791 1187.6724 1206.0420 1219.0972 1223.2338 1242.8888 1277.4340 1294.4327 1297.4040 1314.1066 1318.7801 1348.4691 1355.1387 1383.1907 1386.9540 1394.0787 1399.7291 1416.1572 1450.0561 1470.0811 1472.2233 1477.4925 1488.7879 1513.2567 1533.6393 1591.6475 1641.9720 2814.0403 2908.4735 2972.3904 2976.6104 3006.0843 3015.2392 3029.6152 3054.5835 3084.2786 3129.2751 3140.7449 3166.9831 3392.4852 3530.9546 3578.9304 3587.9854
redmass: 5.6438 4.9268 1.3642 2.2749 5.3498 4.3145 4.7665 4.1072 5.7705 4.8795 4.5582 4.4148 3.9177 2.5719 1.7254 2.8722 3.9949 5.1398 3.7095 3.4397 4.5476 3.7715 1.8613 2.1141 4.0535 1.1621 3.0084 5.2599 6.6770 4.0624 1.1794 4.6853 3.6138 5.1106 1.7973 2.2937 1.5093 1.4638 1.8916 2.9101 3.8554 3.8614 1.3346 3.5927 1.7623 4.4202 5.4500 3.6542 1.5404 2.0794 2.3807 1.5590 1.6368 1.2573 1.2138 1.3245 1.6081 1.9231 1.2148 2.4681 1.6129 1.3812 1.3406 1.3541 1.3659 1.4263 3.7344 1.5205 1.5184 1.2529 2.9827 3.9820 1.0503 1.3101 1.1274 2.3430 2.0186 1.6892 7.0355 7.5938 1.0761 1.0727 1.0832 1.0373 1.0894 1.0866 1.0852 1.0977 1.0987 1.0891 1.0927 1.0962 1.0647 1.0651 1.0809 1.0665
irintensity: 5.9321 1.7841 0.0578 2.0638 3.1900 1.7898 1.5303 2.5646 6.2191 0.1752 3.3837 10.9379 1.5487 30.5504 99.6943 12.5057 10.3838 1.0000 14.9256 9.3982 0.6497 6.9028 116.5986 73.0448 14.4070 91.9100 10.6112 7.6301 15.0920 41.8843 95.2779 5.3300 0.1011 34.5095 8.8545 57.9241 90.2952 5.2247 27.3091 13.2053 53.7236 31.6336 1.7178 15.8078 37.6469 97.0210 22.6942 35.4047 14.0444 21.8220 17.9791 3.1598 8.8136 20.9817 26.7509 14.7283 21.0214 38.8999 34.8244 31.2730 6.1574 6.4915 12.4682 78.9481 9.7071 19.8046 0.2584 106.9317 81.7587 8.9233 13.8800 27.0359 13.2925 17.7113 7.5868 0.8021 3.4647 41.7683 13.1587 10.4887 1719.1437 69.7963 37.8129 36.5152 28.8174 43.3190 22.3569 20.3269 19.3064 13.9571 11.2332 7.3405 97.0083 53.1760 98.4445 10.4301
temp: 298.150 k
press: 1.00000 atm
elementType: 8 8 8 8 7 7 6 6 6 6 6 6 6 6 6 6 6 6 1 1 1 1 1 1 1 1 1 1 1 1 1 1 1 1
symmnumber: 1
zpe: 711989.2 jmol-1
zpe.correction: 0.271182 hartree
zpe.thermalcorrener: 0.287560 hartree
zpe.thermalcorrenthalpy: 0.288505 hartree
zpe.thermalcorrgfe: 0.227307 hartree
zpe.sumelectzpe: -875.916906 hartree
zpe.sumelectthermal: -875.900528 hartree
zpe.sumelectthermalent: -875.899584 hartree
zpe.sumelectthermalfe: -875.960781 hartree
dipole: -1.4991 -2.0867 2.5751
dipole: 3.6377
quadrupole: -89.5043 -109.5994 -108.0856
quadrupole: 2.3728 4.5030 4.6882
quadrupole: 12.8921 -7.2029 -5.6892 2.3728 4.5030 4.6882
hfenergy: -876.1880887 hartree
pointgroup: C01 [X(C12H16N2O4)]
dipole: 0.7364888 1.2222764 0.1089781 debye
polarizability: 227.4624308|-7.784684|126.1452427|2.3705032|-29.3605047|126.4542465 unknown
InChI: InChI=1S/C12H16N2O4/c1-6-2-3-7-8(4-6)14-12(13-7)11(18)10(17)9(16)5-15/h2-4,9-11,14-18H,5H2,1H3
charge 0 multiplicity 1
34 atoms
O  -2.573303 2.103393 -0.281774
O  -1.755708 1.142835 -2.536616
O  -4.021771 0.844877 1.604976
O  -2.214326 -2.374113 1.105852
N  0.636555 0.505562 -1.434658
N  -0.151721 -1.04057 0.020492
C  -2.902426 0.67207 -0.432895
C  -1.864295 0.146883 -1.46084
C  -2.974569 0.008436 0.950941
C  -0.478654 -0.130411 -0.916242
C  1.770154 -0.011546 -0.788959
C  1.257093 -0.985434 0.131943
C  -3.353531 -1.499457 0.922978
C  3.148521 0.260427 -0.909923
C  2.145816 -1.708862 0.957254
C  4.036514 -0.465619 -0.083778
C  3.521246 -1.436504 0.835866
C  5.535786 -0.230463 -0.162017
H  -3.90665 0.581851 -0.899868
H  -2.251994 -0.782671 -1.915063
H  -2.015647 0.131217 1.49247
H  0.569209 1.185751 -2.19241
H  -4.050921 -1.697114 1.760757
H  -3.907117 -1.730535 -0.017603
H  3.529945 1.005303 -1.616635
H  -3.161465 2.449439 0.439832
H  1.769794 -2.455287 1.663121
H  -2.006462 2.013101 -2.108139
H  -4.087585 0.597378 2.560401
H  4.23149 -1.985802 1.465577
H  5.787365 0.565155 -0.884067
H  5.947225 0.064668 0.821419
H  6.069042 -1.148182 -0.47446
H  -1.36681 -1.951677 0.698767
