program: Gaussian 09
title: 000227259
version: EM64L-G09RevD.01
frameworkgroup: C1[X(C9H14N2O5)]
method: RPBEPBE
basis: SDD
operation: Freq
keyword: #p
keyword: freq=noraman
keyword: PBEPBE/SDD
title: #p freq=noraman PBEPBE/SDD
converged: YES YES NO NO
title: Mulliken charges:
elementType: O O O O O N N C C C C C C C C C H H H H H H H H H H H H H H
charge: -0.271511 -0.271362 -0.249951 -0.231725 -0.232401 -0.384137 -0.384313 -0.224922 -0.225064 0.174566 0.254762 0.255660 -0.217802 -0.217804 -0.670758 -0.670924 0.294633 0.294359 0.338962 0.339136 0.231771 0.237467 0.231363 0.238062 0.218328 0.231259 0.231255 0.218395 0.231385 0.231311
chargesum: 0.00000
title: Mulliken charges with hydrogens summed into heavy atoms:
elementType: O O O O O N N C C C C C C C C C
charge: -0.271511 -0.271362 -0.249951 -0.231725 -0.232401 -0.045175 -0.045177 0.069710 0.069294 0.174566 0.254762 0.255660 0.251436 0.251622 0.010084 0.010166
polarizability: 1.25467560e+02 1.03799167e-01 1.43390116e+02 -5.37360818e+00 7.65541758e-02 1.05680980e+02
1716.lowfreq: -8.7402 -0.0007 -0.0004 -0.0003 6.6551 7.1766 14.4243 27.9532 39.6496
frequency: 12.7864 27.8449 39.6088 56.5416 61.2700 75.8066 93.2304 107.9524 140.2632 143.5394 215.3393 216.9381 250.1236 255.4951 304.7142 306.2932 331.4437 332.6978 396.4223 421.8787 467.1845 521.1345 527.7767 541.4234 592.1592 691.6537 695.2284 722.0661 770.7023 797.0838 798.1824 807.4567 814.5995 821.3272 906.2965 922.4714 947.0879 991.8268 1017.3100 1020.0577 1062.6824 1111.7485 1112.4713 1134.7123 1135.1252 1139.1543 1141.2268 1178.4503 1210.7868 1248.9785 1249.7265 1255.9263 1281.0616 1328.7307 1345.6300 1355.3074 1356.4789 1363.9971 1380.9728 1400.4838 1401.3163 1464.1156 1464.3150 1472.9387 1473.3647 1485.4315 1485.5730 1635.4984 1636.1922 1703.3649 2997.2579 2997.5842 3016.4186 3016.7138 3025.7508 3026.6010 3076.3897 3076.6194 3094.1085 3094.4059 3110.1900 3110.5269 3594.1458 3596.1495
redmass: 3.2333 3.7844 3.6767 5.2091 4.3797 3.4151 6.1463 3.4811 2.8987 2.5867 4.3499 3.0790 1.2661 1.4666 5.7709 3.6926 5.0493 5.5929 4.6824 4.5331 2.9020 2.5262 1.3636 2.3761 5.7162 9.5911 6.2988 9.7113 7.1272 1.1250 1.1158 4.3132 4.2937 4.0148 7.5008 7.3760 4.3515 2.4112 2.2855 2.3479 1.9913 2.3629 2.2911 1.5312 1.4727 4.3373 1.6772 5.6189 2.3040 1.1386 1.1380 2.5138 1.3411 1.2783 1.9601 1.3881 1.3761 1.6310 1.7153 1.2613 1.2613 1.0400 1.0400 1.0634 1.0639 1.0665 1.0674 11.7139 11.6851 7.9973 1.0359 1.0359 1.0583 1.0583 1.0843 1.0836 1.1065 1.1066 1.0985 1.0985 1.1033 1.1033 1.0773 1.0804
irintensity: 0.4075 0.1323 0.0114 1.1680 0.7921 0.2398 0.1883 0.1607 0.2865 2.4206 7.3927 14.0437 0.1372 3.6958 0.8278 4.6225 20.5080 17.5089 1.9470 4.2614 107.1438 0.5350 255.9295 4.1527 2.1900 5.2649 18.8702 65.5662 0.9464 6.3259 4.5699 5.3090 9.9425 7.2227 50.5810 35.0622 0.1624 30.5394 96.0659 57.8176 22.0483 13.0993 9.7415 38.7565 9.5378 270.5111 17.0764 373.3576 3.5871 0.2561 0.2062 131.8309 8.2922 0.3713 21.7933 7.1893 2.6850 51.1541 13.8908 20.3868 23.6269 15.7980 10.2306 6.2579 5.0777 17.7537 10.4784 194.0388 167.7441 618.0080 16.3580 17.0130 19.0900 13.9706 9.8521 9.8957 3.6310 3.8196 33.9641 20.6058 41.8618 39.2826 104.4966 7.8704
temp: 298.150 k
press: 1.00000 atm
elementType: 8 8 8 8 8 7 7 6 6 6 6 6 6 6 6 6 1 1 1 1 1 1 1 1 1 1 1 1 1 1
symmnumber: 1
zpe: 616147.6 jmol-1
zpe.correction: 0.234678 hartree
zpe.thermalcorrener: 0.252029 hartree
zpe.thermalcorrenthalpy: 0.252973 hartree
zpe.thermalcorrgfe: 0.186101 hartree
zpe.sumelectzpe: -835.765402 hartree
zpe.sumelectthermal: -835.748052 hartree
zpe.sumelectthermalent: -835.747108 hartree
zpe.sumelectthermalfe: -835.813979 hartree
dipole: -0.0443 -8.0769 0.0081
dipole: 8.0771
quadrupole: -85.3047 -110.0396 -91.1830
quadrupole: -0.0936 9.1246 -0.1297
quadrupole: 10.2044 -14.5305 4.3261 -0.0936 9.1246 -0.1297
hfenergy: -836.0000806 hartree
pointgroup: C01[X(C9H14N2O5)]
dipole: 1.6628789 2.7070011 0.0716194 debye
polarizability: 130.3820116|7.8533803|138.6191203|4.7971528|-1.845689|105.537524 unknown
InChI: InChI=1S/C9H14N2O5/c1-3-15-7(12)5-6(8(13)16-4-2)11-9(14)10-5/h5-6,10-11H,3-4H2,1-2H3
charge 0 multiplicity 1
30 atoms
O  -1.03661 2.107796 0.230223
O  2.384607 0.012532 -0.13565
O  -1.964742 -3.248283 -0.082826
O  -2.471252 1.168539 -1.351094
O  2.158683 -1.739101 1.387537
N  -1.06124 -1.300399 -1.125577
N  -0.673909 -1.60671 1.073106
C  -0.428883 -0.054918 -0.686495
C  0.15797 -0.457476 0.709834
C  -1.310065 -2.177979 -0.049195
C  -1.444394 1.107598 -0.640121
C  1.65652 -0.830282 0.690499
C  -1.904262 3.333504 0.287877
C  3.87154 -0.205158 -0.163551
C  -1.259045 4.284018 1.288951
C  4.446212 0.802473 -1.151592
H  0.390629 0.265586 -1.354949
H  0.04979 0.386473 1.415011
H  -1.661454 -1.32947 -1.949306
H  -0.450919 -2.190676 1.878681
H  -1.960293 3.756378 -0.731103
H  -2.918378 3.016657 0.589207
H  4.252574 -0.064347 0.863714
H  4.055228 -1.252312 -0.462301
H  -1.861072 5.207745 1.363737
H  -1.20347 3.82619 2.291233
H  -0.238887 4.560095 0.972438
H  5.544029 0.686368 -1.202938
H  4.034808 0.644166 -2.163006
H  4.221586 1.836497 -0.839346
