program: Gaussian 09
title: 000227257
version: EM64L-G09RevD.01
frameworkgroup: C1[X(C15H16N4O2)]
method: RPBEPBE
basis: SDD
operation: Freq
keyword: #p
keyword: freq=noraman
keyword: PBEPBE/SDD
title: #p freq=noraman PBEPBE/SDD
converged: YES YES NO NO
title: Mulliken charges:
elementType: O O N N N N C C C C C C C C C C C C C C C H H H H H H H H H H H H H H H H
charge: -0.271207 -0.271218 -0.152854 -0.152921 0.053107 0.053129 -0.719081 0.532889 0.532869 -0.448786 -0.448825 -0.386767 -0.386809 0.401997 0.402131 -0.355740 -0.355784 -0.346434 -0.346422 -0.677925 -0.677923 0.231305 0.231352 0.237507 0.237488 0.244488 0.244518 0.281810 0.281774 0.243870 0.243851 0.279311 0.245884 0.247109 0.245897 0.247089 0.279321
chargesum: 0.00000
title: Mulliken charges with hydrogens summed into heavy atoms:
elementType: O O N N N N C C C C C C C C C C C C C C C
charge: -0.271207 -0.271218 -0.152854 -0.152921 0.053107 0.053129 -0.256424 0.532889 0.532869 -0.211279 -0.211337 -0.142279 -0.142291 0.401997 0.402131 -0.073930 -0.074010 -0.102564 -0.102571 0.094379 0.094384
polarizability: 3.54913432e+02 -7.63638836e-03 1.68330324e+02 -3.65879820e+01 6.79032124e-03 1.48602662e+02
1716.lowfreq: -1.9908 -0.0008 -0.0005 0.0001 3.5957 8.2987 12.7969 16.5118 26.3790
frequency: 11.6420 16.3014 26.3750 28.0490 36.2935 77.4958 93.6947 141.4277 168.0223 179.6484 180.3204 203.3061 203.7098 269.9772 293.0301 308.0212 329.0291 349.5598 358.5853 383.8884 391.1496 401.5073 407.5401 408.7407 427.6847 445.6554 471.4351 524.8291 529.0723 618.2837 629.3255 643.4424 645.4752 719.4093 728.5056 779.2474 783.2228 802.8800 820.2360 826.0988 833.3523 842.0058 863.3063 863.9082 864.8190 932.0465 958.6073 967.2450 985.5441 986.4793 1004.9938 1005.0660 1049.6012 1050.3144 1104.6525 1104.6917 1115.3502 1121.7877 1169.8827 1171.0562 1185.9315 1195.9334 1196.0116 1205.7067 1225.4049 1289.8700 1304.2035 1305.0024 1314.6008 1321.3748 1356.0122 1358.6523 1386.9992 1390.4044 1411.0652 1411.4059 1424.6994 1424.8126 1462.1075 1470.9197 1471.3440 1487.3175 1487.3439 1504.7401 1506.1350 1579.2094 1584.6164 1620.1041 1622.6816 2971.2975 2989.2366 2989.3316 3017.0724 3083.4205 3083.5671 3101.6953 3101.7200 3125.0874 3125.2656 3132.0127 3132.1602 3165.6076 3165.6381 3191.9574 3191.9915
redmass: 5.5405 6.6783 3.6451 3.5938 3.9572 5.1311 5.5392 9.0558 5.4243 1.2375 1.2491 3.6170 3.3080 4.6007 4.2568 6.1850 4.2334 2.7624 4.3921 4.7426 4.4293 5.8189 2.9792 2.9459 5.7417 4.2765 4.7869 2.7136 3.0991 5.9774 5.9151 4.4451 6.0872 3.2479 4.2002 3.6583 4.8806 4.1922 1.4477 4.8680 1.3518 1.3129 1.8588 3.5515 3.4547 1.6289 1.3679 1.5248 1.3589 1.3893 3.1272 3.1260 5.3373 4.7364 1.3193 1.3192 1.4734 1.4515 1.8606 1.6972 1.1681 1.1528 1.2305 2.0994 2.0476 1.6463 4.0301 3.7789 1.4131 1.8196 4.4184 3.2869 6.1660 6.8195 1.3360 1.3159 2.8090 2.7093 1.1022 1.0750 1.0812 1.0478 1.0477 2.7268 2.6360 7.1581 6.9787 6.3174 6.3227 1.0599 1.0321 1.0321 1.1003 1.1025 1.1026 1.0996 1.0996 1.0907 1.0907 1.0893 1.0892 1.0941 1.0941 1.0938 1.0938
irintensity: 4.8249 3.4835 1.9010 2.9751 0.6273 1.0307 0.5369 3.1667 5.6604 0.2805 0.2881 0.1202 0.5043 1.7310 4.5620 0.3121 2.1261 0.1094 1.6979 4.4084 5.2827 1.7684 2.2446 0.0585 2.9702 1.9490 1.9799 26.6238 13.4163 0.0745 1.1862 3.6973 0.9455 1.1518 0.7416 25.3845 60.6228 1.2232 65.0540 58.1512 4.3612 27.8388 30.9768 326.6819 16.8750 11.3454 0.3452 1.8605 0.7318 1.0389 1.4858 38.2369 4.8235 273.3179 0.0079 0.0071 10.0514 9.8157 0.1350 47.5730 1.1801 9.4265 4.7679 0.4292 0.4225 9.2060 0.3406 77.0289 3.2823 108.0976 40.4665 261.0180 88.0349 2.6497 10.9464 53.5200 28.3571 3.0060 12.5281 58.6636 27.7767 20.8990 23.9425 157.7667 35.2832 1.2767 0.5895 0.7513 4.0742 28.3201 20.8708 19.8306 10.3860 17.8987 17.6191 2.7217 3.0406 16.9675 13.2039 22.6590 6.5930 10.0096 8.4135 0.2623 0.5469
temp: 298.150 k
press: 1.00000 atm
elementType: 8 8 7 7 7 7 6 6 6 6 6 6 6 6 6 6 6 6 6 6 6 1 1 1 1 1 1 1 1 1 1 1 1 1 1 1 1
symmnumber: 1
zpe: 752023.4 jmol-1
zpe.correction: 0.286431 hartree
zpe.thermalcorrener: 0.306182 hartree
zpe.thermalcorrenthalpy: 0.307126 hartree
zpe.thermalcorrgfe: 0.233942 hartree
zpe.sumelectzpe: -949.014041 hartree
zpe.sumelectthermal: -948.994289 hartree
zpe.sumelectthermalent: -948.993345 hartree
zpe.sumelectthermalfe: -949.066529 hartree
dipole: 0.0057 -0.4295 0.0106
dipole: 0.4297
quadrupole: -189.2888 -112.3863 -116.9234
quadrupole: 0.0809 24.5005 -0.0184
quadrupole: -49.7560 27.1465 22.6094 0.0809 24.5005 -0.0184
hfenergy: -949.3004714 hartree
pointgroup: C01 [X(C15H16N4O2)]
dipole: 0.0021837 -0.1689813 0.0040332 debye
polarizability: 353.5281517|-0.1126628|168.3303806|-40.2808163|0.0432003|149.9878856 unknown
InChI: InChI=1S/C15H16N4O2/c1-18(16-20)14-7-3-12(4-8-14)11-13-5-9-15(10-6-13)19(2)17-21/h3-10H,11H2,1-2H3
charge 0 multiplicity 1
37 atoms
O  -7.013056 -1.184808 0.746471
O  7.008599 -1.196557 -0.750875
N  -4.954676 -0.843228 -0.140074
N  4.952825 -0.849284 0.139167
N  -5.933202 -0.498794 0.813503
N  5.929066 -0.510125 -0.818626
C  0.00091 2.204106 0.000278
C  -1.288047 1.385231 -0.017025
C  1.28865 1.383209 0.016989
C  -2.349172 1.671772 0.879803
C  2.351362 1.671156 -0.877485
C  -1.478345 0.336739 -0.949864
C  1.476419 0.331766 0.947049
C  -3.735163 -0.094526 -0.091103
C  3.734116 -0.099266 0.090415
C  -3.558498 0.952336 0.854487
C  3.559948 0.950458 -0.85242
C  -2.681559 -0.396129 -0.993846
C  2.678785 -0.402492 0.990621
C  -5.188104 -1.914776 -1.122496
C  5.187579 -1.917194 1.125217
H  0.022004 2.872641 -0.883578
H  -0.018971 2.872115 0.884558
H  -2.229252 2.476998 1.615083
H  2.233413 2.478641 -1.610614
H  -0.672733 0.083376 -1.648764
H  0.669441 0.077166 1.643897
H  -4.362288 1.189377 1.55388
H  4.365031 1.18877 -1.549891
H  -2.789159 -1.197417 -1.730608
H  2.784301 -1.206504 1.724709
H  -6.204252 -2.299867 -0.936146
H  -4.456301 -2.731299 -0.993364
H  -5.125056 -1.521414 -2.151915
H  4.459747 -2.7374 0.996339
H  5.119534 -1.520938 2.153137
H  6.205704 -2.298939 0.942794
