program: Gaussian 09
title: 000227255
version: EM64L-G09RevD.01
frameworkgroup: C1[X(C6H10O5)]
method: RPBEPBE
basis: SDD
operation: Freq
keyword: #pfreq=noraman
keyword: PBEPBE/SDD
title: #p freq=noraman PBEPBE/SDD
converged: YES YES NO NO
title: Mulliken charges:
elementType: O O O O O C C C C C C H H H H H H H H H H
charge: -0.261306 -0.418927 -0.431114 -0.219486 -0.194829 -0.027941 -0.040676 -0.697397 -0.704232 0.163144 0.146841 0.225949 0.263558 0.240428 0.229445 0.245477 0.238291 0.222204 0.255135 0.381551 0.383885
chargesum: 0.00000
title: Mulliken charges with hydrogens summed into heavy atoms:
elementType: O O O O O C C C C C C
charge: -0.261306 -0.037375 -0.047229 -0.219486 -0.194829 0.198008 0.222883 0.017953 0.011397 0.163144 0.146841
polarizability: 9.70538047e+01 1.92509492e+00 7.98570090e+01 5.72769104e+00 3.89146456e-01 6.60804629e+01
1716.lowfreq: -9.0463 -3.6677 -0.0009 -0.0004 -0.0003 4.0959 19.4209 35.0538 39.9761
frequency: 18.2550 35.0019 39.9709 94.3235 125.4388 186.6970 209.9996 217.2581 255.2812 273.9160 292.1894 340.6615 363.5321 450.4084 522.3009 558.0647 579.3512 590.4553 620.0570 693.6119 698.4482 770.2640 791.1039 838.4638 950.0117 1014.8951 1021.2185 1023.4708 1056.0710 1073.3896 1101.8818 1114.2613 1142.1087 1248.0636 1250.0321 1279.3398 1296.6010 1327.0328 1359.4944 1381.7897 1388.7861 1460.9969 1473.5262 1475.2542 1479.4969 1664.5764 1692.9531 2971.3507 2996.4087 3009.7959 3012.2522 3093.7081 3107.4353 3115.8129 3122.8704 3512.1518 3522.8683
redmass: 5.1494 6.2090 9.7465 4.8199 4.3621 2.8477 1.0922 1.4158 3.6235 3.3344 3.1841 4.6523 3.6838 5.4532 3.2496 2.8986 1.4759 1.4985 3.0945 3.8571 3.9560 2.8048 2.5509 2.7504 2.0327 2.5105 2.6845 3.1633 2.1614 2.1429 2.6544 1.9766 2.1468 1.5207 1.5599 1.2317 1.3035 1.6300 1.6271 1.2105 1.2155 1.0490 1.0636 1.0442 1.0504 8.9903 9.3556 1.0814 1.0357 1.0344 1.0832 1.1000 1.1004 1.1011 1.1013 1.0642 1.0642
irintensity: 0.1502 0.2099 0.5115 6.7104 2.0183 0.8893 0.1453 0.4381 0.2583 0.9957 0.1537 3.3429 4.1881 24.5303 32.0345 39.8073 144.0412 19.5867 81.8748 28.3264 45.2943 2.4069 5.0861 8.3613 1.9829 193.9021 257.3620 249.5610 88.3331 13.3592 27.5608 3.9670 20.4732 15.9222 4.8276 1.5456 1.4835 4.8596 11.8690 22.7069 17.2644 12.7437 11.1286 13.0924 16.5721 202.4729 221.8246 21.2411 19.1708 13.2451 13.9699 24.3198 13.7861 16.6355 14.2664 24.2262 26.1990
temp: 298.150 k
press: 1.00000 atm
elementType: 8 8 8 8 8 6 6 6 6 6 6 1 1 1 1 1 1 1 1 1 1
symmnumber: 1
zpe: 420517.0 jmol-1
zpe.correction: 0.160166 hartree
zpe.thermalcorrener: 0.172794 hartree
zpe.thermalcorrenthalpy: 0.173738 hartree
zpe.thermalcorrgfe: 0.119191 hartree
zpe.sumelectzpe: -609.875655 hartree
zpe.sumelectthermal: -609.863028 hartree
zpe.sumelectthermalent: -609.862084 hartree
zpe.sumelectthermalfe: -609.916631 hartree
dipole: 1.5505 -1.8358 2.3031
dipole: 3.3284
quadrupole: -51.2888 -68.0863 -65.7292
quadrupole: 3.2422 -1.2062 0.3020
quadrupole: 10.4126 -6.3849 -4.0277 3.2422 -1.2062 0.3020
hfenergy: -610.0358214 hartree
pointgroup: C01 [X(C6H10O5)]
dipole: -0.4732221 -0.4595672 1.1312302 debye
dipolederiv: -1.0970652 -0.0086869 -0.1593898 -0.1188995 -0.4199584 -0.0010725 -0.1698372 0.0105627 -0.3563056 -1.1066681 -0.1916518 0.3221418 -0.1293483 -0.3005015 0.1166094 0.4212094 0.1403018 -0.5798878 -0.8633152 -0.2952773 -0.4222061 -0.2932345 -0.5901799 -0.2089608 -0.3601567 -0.1928263 -0.5679705 -0.6566532 -0.0469842 0.1614319 -0.3088645 -0.8569289 -0.0462511 0.0689996 -0.1476047 -0.3639174 -0.5754533 -0.0794542 0.2309157 -0.1300935 -0.3482669 -0.0791103 -0.0280849 -0.1343561 -0.9260269 0.8498769 -0.0369316 -0.0013344 0.0853649 0.1940421 -0.1445796 -0.1449426 -0.1523379 0.1392239 0.5263416 -0.0851154 0.2379934 -0.0521446 0.3275596 0.0175761 0.5645552 0.0403561 0.1544881 -0.082996 0.0582604 0.01081 -0.0020469 0.0195619 -0.0441848 -0.0485055 -0.0055325 0.0348442 -0.1261167 -0.0110515 -0.0209025 0.0523043 -0.0222234 0.0768852 -0.1514292 0.0748913 -0.0497645 1.160914 0.2347664 -0.5616951 0.3972543 1.0169685 0.1124957 -0.5372738 0.1778857 0.5205596 1.2077078 0.4888242 -0.0173233 0.4965559 0.4432721 0.2874506 0.0828202 0.295402 1.3043504 -0.0055224 0.0130534 0.0005171 -0.0035781 -0.0533015 0.081792 0.0732525 0.1069889 -0.0454636 0.0660496 0.0191718 -0.0060875 -0.0404125 -0.0371369 -0.0493391 -0.0625399 -0.048845 0.0085202 0.1097876 -0.0152151 0.0012907 0.0066264 -0.0357176 0.1143664 -0.0375324 0.0623252 0.0128094 -0.1007504 -0.0497241 0.0231468 -0.0479202 0.1050837 0.0081378 0.052421 0.0304496 0.0738379 0.0887078 0.0692848 0.0316503 0.0671043 -0.0316813 -0.0872244 0.0176905 -0.0967063 0.0245095 0.1080963 0.0268994 0.018977 0.0396527 -0.0643375 -0.0398806 0.0329813 -0.1054597 0.0226446 -0.0552427 -0.0423813 0.1360787 -0.0338408 0.0474103 0.0497907 0.1409243 0.0324885 0.0200178 -0.0269662 -0.0144219 -0.1111395 -0.0138316 0.0972685 -0.038998 -0.1134076 -0.0183194 0.0515228 0.342161 -0.0014385 0.0191801 0.0451359 0.1276215 -0.1135475 0.0481358 -0.0861208 0.3324877 0.2371068 -0.0319264 0.1059446 -0.0157836 0.3814456 -0.011955 0.1507201 0.0164568 0.1895203 unknown
polarizability: 96.2069281|7.2442613|69.9237866|-3.5063346|5.2122874|76.8605618 unknown
InChI: InChI=1S/C6H10O5/c1-3(5(7)8)11-4(2)6(9)10/h3-4,7,9H,1-2H3
charge 0 multiplicity 1
21 atoms
O  -0.000147 -0.544433 -0.680163
O  -3.124287 -0.048985 1.238854
O  3.245414 0.670556 0.354804
O  -1.462617 1.499456 0.743686
O  2.516075 -0.142001 -1.699829
C  -1.331766 -0.831648 -0.164539
C  1.041959 -0.25436 0.317175
C  -2.197706 -1.153497 -1.397537
C  1.320293 -1.431486 1.282072
C  -1.926299 0.347003 0.624736
C  2.295128 0.072478 -0.495937
H  -1.324211 -1.708742 0.516149
H  0.773715 0.65384 0.891259
H  -2.22085 -0.288557 -2.081166
H  -3.225061 -1.411158 -1.092798
H  -1.748258 -2.005464 -1.933244
H  1.545772 -2.351893 0.715827
H  0.452696 -1.62066 1.938201
H  2.182052 -1.185879 1.925302
H  -3.516764 0.722517 1.731212
H  4.068262 0.872513 -0.167364
