program: Gaussian 09
title: 000227254
version: EM64L-G09RevD.01
frameworkgroup: C1[X(C5H5ClN2)]
method: RPBEPBE
basis: SDD
operation: Freq
keyword: #p
keyword: freq=noraman
keyword: PBEPBE/SDD
title: #p freq=noraman PBEPBE/SDD
converged: NO NO NO NO
title: Mulliken charges:
elementType: Cl N N C C C C C H H H H H
charge: -0.006895 -0.098682 -0.012043 0.177935 -0.246229 -0.754338 -0.109806 -0.208515 0.252148 0.235046 0.234902 0.266912 0.269564
chargesum: 0.00000
title: Mulliken charges with hydrogens summed into heavy atoms:
elementType: Cl N N C C C C C
charge: -0.006895 -0.098682 -0.012043 0.177935 0.005918 -0.017478 0.159758 -0.208515
polarizability: 1.16552835e+02 -7.05918251e-01 6.92782210e+01 -4.16304917e-03 -1.05515516e-04 3.55775832e+01
1716.lowfreq: 0.0004 0.0029 0.0031 1.3033 4.1441 24.3962 83.2363 103.8862 239.3238
frequency: 83.1916 103.8742 239.3237 287.2367 365.6450 370.0117 388.0027 475.9304 610.5216 626.6192 736.2121 788.8871 827.7507 965.9762 974.6067 983.7339 1035.1999 1049.5064 1114.3760 1138.0065 1226.0788 1306.4541 1357.5658 1397.0197 1455.4245 1468.0380 1512.2533 1552.2741 2986.6165 3065.7309 3119.6930 3147.9313 3182.0740
redmass: 1.2925 2.6092 5.2153 3.7583 7.2088 3.9674 5.4861 3.3906 7.7459 6.7107 5.2654 6.9699 1.3633 1.9389 1.3236 3.3186 4.1809 1.5578 7.0360 1.3772 2.4841 3.3592 2.9641 1.2675 1.1500 1.0456 3.7534 6.1091 1.0380 1.0976 1.0984 1.0913 1.0983
irintensity: 0.3382 0.8949 0.3734 1.1714 3.3432 11.9666 0.2366 1.5047 0.3493 14.8047 0.0007 8.8173 31.8013 12.6302 0.1073 2.1826 32.1660 9.5270 71.8223 15.3440 2.2117 4.5126 116.3389 33.5303 22.8641 17.3667 22.2125 2.4566 14.2248 15.0054 5.2031 5.7739 2.2483
temp: 298.150 k
press: 1.00000 atm
elementType: 17 7 7 6 6 6 6 6 1 1 1 1 1
symmnumber: 1
zpe: 238904.8 jmol-1
zpe.correction: 0.090994 hartree
zpe.thermalcorrener: 0.098350 hartree
zpe.thermalcorrenthalpy: 0.099295 hartree
zpe.thermalcorrgfe: 0.058549 hartree
zpe.sumelectzpe: -762.469325 hartree
zpe.sumelectthermal: -762.461968 hartree
zpe.sumelectthermalent: -762.461024 hartree
zpe.sumelectthermalfe: -762.501769 hartree
dipole: -2.7616 4.6896 0.0006
dipole: 5.4423
quadrupole: -48.8944 -55.4163 -54.0467
quadrupole: -1.2547 -0.0019 -0.0006
quadrupole: 3.8914 -2.6305 -1.2609 -1.2547 -0.0019 -0.0006
hfenergy: -762.5603186 hartree
pointgroup: C01 [X(C5H5Cl1N2)]
dipole: 1.0753902 1.8515156 -0.0006599 debye
dipolederiv: -0.9322122 0.0069592 0.0003741 0.0027599 -0.0943996 -0.0000039 0.0003243 -0.0000076 -0.0652167 -0.1597899 0.1932667 -0.0000029 -0.2674137 -0.0029573 0.0002021 -0.0000214 -0.0000962 -0.2365508 -0.5549854 -0.1690299 0.0001593 0.4638406 -0.1610858 -0.0002307 0.0001477 0.0001075 -0.1759062 0.616238 -0.0607666 -0.0004765 0.0344167 -0.1158734 -0.000053 -0.0008912 0.0000512 0.0990104 -0.1273779 0.0498982 0.0000223 0.1318012 0.0971803 -0.0001272 0.0001392 -0.0001093 -0.0842656 -0.2748015 0.0037458 0.0003346 -0.1097247 0.0289278 0.0002313 0.0012023 0.0001825 0.0596637 -0.3193283 -0.0370717 0.0000821 -0.1469683 0.0496028 0.000106 0.0001199 0.0000408 -0.0425444 1.5143473 0.0513225 -0.0005601 -0.1355077 0.1103074 0.0000628 -0.0005133 -0.0000106 0.0904889 0.0436903 -0.08418 0.00003 -0.0806952 -0.018036 0.0000423 0.0000144 0.0000177 0.1390949 0.012365 -0.011217 0.0406341 -0.0288703 0.0723454 0.1000509 0.0898577 0.0804232 -0.0300967 0.0122882 -0.0114511 -0.0405979 -0.0294448 0.0712328 -0.1006867 -0.0900375 -0.080926 -0.0290258 0.1020894 0.00377 -0.0000422 0.1028103 -0.0492031 0.0004453 -0.0003665 0.0003791 0.1237842 0.067477 0.0647538 0.0000432 0.062996 0.0119587 -0.0000392 0.0000243 -0.0000521 0.1515642 unknown
polarizability: 116.5426213|0.9899842|69.2884135|-0.0415933|0.0008856|35.5776044 unknown
InChI: InChI=1S/C5H5ClN2/c1-4-2-3-5(6)8-7-4/h2-3H,1H3
charge 0 multiplicity 1
13 atoms
Cl -3.128511 -0.071877 0.001025
N  0.714169 -1.184538 -0.000602
N  -0.66737 -1.183658 0.000008
C  1.397515 0.013277 -0.000901
C  0.71759 1.266305 -0.000563
C  2.903228 -0.096728 -0.001813
C  -0.684853 1.272257 0.000079
C  -1.3140 0.004383 0.000341
H  1.282276 2.204234 -0.000766
H  3.339636 0.388548 -0.894569
H  3.34116 0.393266 0.887573
H  3.19041 -1.159502 0.000566
H  -1.269151 2.195534 0.000422
