program: Gaussian 09
title: 000227249
version: EM64L-G09RevD.01
frameworkgroup: C1[X(C10H8ClNO3)]
method: RPBEPBE
basis: SDD
operation: Freq
keyword: #p
keyword: freq=noraman
keyword: PBEPBE/SDD
title: #p freq=noraman PBEPBE/SDD
converged: NO YES NO NO
title: Mulliken charges:
elementType: Cl O O O N C C C C C C C C C C H H H H H H H H
charge: -0.053932 -0.444119 -0.249921 -0.195344 -0.399557 0.535966 0.259650 -0.421781 -0.348347 -0.331805 -0.327276 -0.027991 0.110281 -0.156184 -0.076007 0.236547 0.229473 0.276917 0.278589 0.323197 0.241565 0.152397 0.387681
chargesum: 0.00000
title: Mulliken charges with hydrogens summed into heavy atoms:
elementType: Cl O O O N C C C C C C C C C C
charge: -0.053932 -0.056438 -0.249921 -0.195344 -0.076361 0.535966 0.259650 -0.185234 -0.118874 -0.054888 -0.048687 0.213574 0.110281 -0.156184 0.076390
polarizability: 3.37788473e+02 -1.40720675e+01 1.36228466e+02 -3.79560924e-03 -1.23031758e-02 5.09591689e+01
1716.lowfreq: -12.9951 -4.3861 -0.0028 -0.0022 -0.0020 3.6488 23.3792 38.8569 63.6246
frequency: 23.1862 38.8134 63.6196 76.1689 103.1490 150.0840 168.5528 172.7529 224.7413 283.7134 292.0570 342.1964 408.7017 408.9885 435.7466 455.5380 503.0100 506.6179 577.6395 586.5211 593.8311 633.1908 676.0378 682.6334 735.9891 741.5042 762.7161 825.3680 845.0480 851.6292 873.4323 941.6599 981.3540 989.1580 995.2223 1019.5565 1126.0649 1149.3149 1166.8707 1199.6617 1213.1641 1284.5731 1307.4551 1326.7740 1339.3389 1365.4992 1388.1127 1432.9487 1479.9399 1514.7037 1586.1008 1602.4341 1625.3412 1643.6109 1658.3925 2845.9064 3129.6724 3152.2939 3168.7052 3173.4745 3183.0956 3467.8030 3536.2806
redmass: 6.3048 8.6610 8.6846 6.4495 6.7939 10.4597 5.0283 11.4358 8.6682 7.7515 4.4610 2.3635 2.8601 7.5205 3.0058 7.5575 2.7857 5.2928 5.6211 1.2172 6.4264 7.0557 6.0596 3.3008 1.4509 5.3317 3.6396 1.3277 5.0126 1.7062 1.3314 1.6613 1.3826 1.3646 4.2922 2.9020 1.3805 1.8613 3.6463 1.2171 3.3232 1.3569 1.4172 2.6846 2.1382 2.3224 1.6416 4.1873 1.9413 3.1639 6.1649 7.3526 6.3125 7.9705 4.6748 1.0825 1.0903 1.0896 1.0953 1.0900 1.0958 1.0755 1.0642
irintensity: 0.1054 3.2607 4.4944 1.1256 4.1300 2.3624 0.5556 3.2329 0.6800 0.6456 4.5432 7.9232 0.5848 30.2501 0.1392 3.7376 56.8393 9.9703 15.6785 73.9893 50.3256 0.1220 25.6174 82.1057 32.0307 1.4516 41.1816 0.3293 12.0318 39.7643 77.9899 11.0264 0.2384 0.0286 156.3756 270.1007 19.4755 376.8177 186.3012 0.7917 52.3964 23.1084 7.2950 172.6780 328.3858 1.6730 19.2415 4.4176 42.4122 185.3939 38.8806 865.5223 362.5440 433.9377 275.8549 83.6972 8.5185 8.7325 2.2875 6.5408 3.6820 34.5010 65.9008
temp: 298.150 k
press: 1.00000 atm
elementType: 17 8 8 8 7 6 6 6 6 6 6 6 6 6 6 1 1 1 1 1 1 1 1
symmnumber: 1
zpe: 424899.6 jmol-1
zpe.correction: 0.161836 hartree
zpe.thermalcorrener: 0.175755 hartree
zpe.thermalcorrenthalpy: 0.176699 hartree
zpe.thermalcorrgfe: 0.118741 hartree
zpe.sumelectzpe: -1125.275679 hartree
zpe.sumelectthermal: -1125.261760 hartree
zpe.sumelectthermalent: -1125.260815 hartree
zpe.sumelectthermalfe: -1125.318773 hartree
dipole: -4.1232 -1.2001 0.0045
dipole: 4.2943
quadrupole: -137.9787 -84.5729 -96.5041
quadrupole: 12.5202 0.0260 -0.0036
quadrupole: -31.6268 21.7790 9.8478 12.5202 0.0260 -0.0036
hfenergy: -1125.4375145 hartree
pointgroup: C01 [X(C10H8Cl1N1O3)]
dipole: -1.5924625 -0.5643705 0.001766 debye
dipolederiv: -0.161485 -0.0560934 -0.0000449 -0.343508 -0.585801 0.0000515 -0.0000766 0.0003203 -0.0326602 -0.740213 -0.3906356 -0.0000163 -0.7962762 -1.1060823 -0.0001413 -0.0004407 -0.0005581 -0.4293227 -1.3647192 0.2590071 -0.0000063 0.353388 -0.7397922 -0.0001902 -0.0008101 0.0003181 -0.3346722 -1.7254519 0.2613554 -0.0008274 0.0124889 -0.3361383 -0.0002242 0.004132 -0.000784 -0.3292229 -2.4964555 0.0644934 0.0000681 0.873392 -0.2508517 -0.000003 -0.0012362 0.0001057 -0.2695761 2.1709879 0.0840448 0.0000493 0.3815466 0.1545446 0.0000143 0.0002768 -0.0000538 0.1253455 -1.3254373 -0.0838732 -0.0002074 -0.2732797 -0.1683927 -0.0000184 -0.0001571 -0.0000076 -0.0192539 -0.8120604 0.0522533 -0.000016 0.3802117 0.0525353 -0.0000088 0.0000195 -0.0000326 -0.2022103 -0.5226046 -0.0902333 -0.0000402 -0.5993619 -0.0778085 -0.0000215 0.0001076 0.0000085 -0.1923904 0.534312 -0.0140808 0.0000318 0.3057521 0.107305 -0.0000025 0.0001675 0.000007 -0.085247 0.4438156 0.0407609 0.0000325 -0.0669438 0.0711505 -0.0000259 0.0002319 0.0000115 -0.0890206 1.9523165 -0.2742715 0.0001871 -1.1842619 -0.0136823 -0.0000805 -0.0003526 0.0000595 0.0018276 2.679749 0.1388297 0.0003642 0.3884064 1.4212788 0.0003387 0.0011639 0.0002342 0.2363674 -1.5526579 0.5362991 0.0000241 1.2870087 0.624831 -0.0004847 0.0006766 -0.0003768 -0.1565961 2.191623 -0.4419174 0.0006868 -0.9196277 0.5796981 0.001062 -0.0041972 0.0019739 0.131669 0.0306681 -0.0963367 -0.0000126 -0.080619 -0.0402385 0.0000185 -0.0000427 0.0000179 0.1701506 0.0015988 0.0977801 -0.0000222 0.1148773 0.0028596 0.0000067 -0.0000299 0.0000013 0.1652283 0.0739942 0.0750967 -0.000008 0.044874 0.0418194 0.0000153 -0.0000201 0.0000138 0.1559456 0.1085136 -0.0330354 0.0000103 -0.0423823 0.0086267 0.0000146 0.0000036 0.000016 0.1571922 0.173505 0.0309511 -0.0000249 0.0241622 0.167451 0.0000726 0.0000232 0.0000487 0.3070463 0.1014051 -0.0740425 0.0000588 -0.0107374 -0.0054421 0.000063 0.0001143 0.0000546 0.1770813 0.0477505 -0.1498988 -0.0001552 -0.0305907 -0.2324493 -0.0004744 0.0005712 -0.0013767 0.1098323 0.1908456 0.063547 -0.0001314 0.1814807 0.3245789 0.0000184 -0.0001249 -0.0000013 0.4024862 unknown
polarizability: 338.7368218|-2.4443036|135.2801179|-0.0030841|-0.0125005|50.9591689 unknown
InChI: InChI=1S/C10H8ClNO3/c11-8(6-13)5-12-9-3-1-7(2-4-9)10(14)15/h1-6,12,14H
charge 0 multiplicity 1
23 atoms
Cl 4.226794 1.771942 0.000047
O  -4.691616 -1.549003 -0.000734
O  -5.135154 0.732539 -0.000849
O  6.038889 -0.797808 -0.002483
N  1.377619 0.606684 0.00042
C  -0.01147 0.349029 0.000331
C  -2.821769 -0.042247 0.000148
C  -0.893766 1.466334 0.000092
C  -0.549283 -0.967621 0.000431
C  -2.28169 1.271153 -0.000018
C  -1.941268 -1.154762 0.000334
C  2.400723 -0.308203 0.000992
C  -4.294176 -0.199808 0.000102
C  3.744493 0.010469 0.00106
C  4.795076 -1.000624 0.001854
H  -0.483605 2.483218 0.000016
H  0.102397 -1.846119 0.000538
H  -2.970156 2.12191 -0.000181
H  -2.361789 -2.16383 0.000413
H  1.667734 1.59211 0.00004
H  2.128242 -1.366573 0.001558
H  4.37537 -2.041485 -0.001967
H  -5.685193 -1.586005 -0.001443
