program: Gaussian 09
title: 000227243
version: EM64L-G09RevD.01
frameworkgroup: C1[X(C8H13NO)]
method: RPBEPBE
basis: SDD
operation: Freq
keyword: #p
keyword: freq=noraman
keyword: PBEPBE/SDD
title: #p freq=noraman PBEPBE/SDD
converged: YES YES NO NO
title: Mulliken charges:
elementType: O N C C C C C C C C H H H H H H H H H H H H H
charge: -0.446351 -0.075206 -0.073644 -0.427250 -0.404808 -0.410988 -0.359861 -0.417808 0.201501 -0.499000 0.205257 0.207840 0.232673 0.195276 0.196958 0.213839 0.200219 0.236010 0.173804 0.209641 0.234170 0.331824 0.275905
chargesum: 0.00000
title: Mulliken charges with hydrogens summed into heavy atoms:
elementType: O N C C C C C C C C
charge: -0.114527 -0.075206 0.131613 0.013263 0.009249 -0.018754 0.049954 0.026002 0.201501 -0.223095
polarizability: 1.19057983e+02 8.18786845e+00 8.72400352e+01 -5.64652931e+00 -1.61743193e+00 6.91017144e+01
1716.lowfreq: -24.4586 -8.6991 -3.6466 -0.0008 -0.0002 0.0005 55.2936 94.6863 155.2061
frequency: 55.2177 94.6472 155.1924 170.1821 239.5503 264.3994 307.1206 323.3178 342.9188 356.4847 379.4720 419.7693 465.9352 503.7045 603.8819 628.6536 662.2325 764.9284 836.0407 867.4048 904.8029 935.9377 955.6864 964.6670 982.6825 1010.6630 1043.2951 1094.9502 1100.4411 1124.4395 1148.0028 1155.3507 1190.2156 1237.9070 1254.9587 1269.2208 1277.1042 1301.1813 1318.0743 1337.7592 1343.1350 1360.6877 1381.7914 1402.7652 1453.1253 1458.8721 1466.1215 1468.6255 1480.1535 2144.2040 2827.0387 2833.2793 2854.4527 2964.0137 2991.4952 2994.9777 3000.6412 3003.4266 3047.9532 3053.7416 3066.8872 3426.3284 3554.2793
redmass: 4.0045 3.6855 2.6612 2.8815 3.1489 2.2253 1.1100 3.0220 2.4953 5.2865 2.9773 3.5790 2.3739 2.6435 3.5144 1.2307 1.2406 2.6424 2.6469 1.4186 2.2455 3.2733 2.3468 1.5367 2.0336 3.9204 1.9705 2.2478 1.7385 1.6997 2.6243 1.5670 1.2636 1.2787 1.3891 1.3076 1.2325 1.2574 1.3052 1.3743 1.4239 1.4030 1.6031 1.5430 1.0831 1.0892 1.0831 1.0906 1.0959 6.0220 1.0712 1.0702 1.0679 1.0833 1.0616 1.0630 1.0896 1.0854 1.0879 1.1001 1.1026 1.1595 1.0661
irintensity: 0.3019 0.7821 1.7511 6.3975 2.7156 4.3482 149.6133 6.8673 9.5253 1.8391 6.8800 2.3874 6.7058 3.3054 2.7320 76.7067 67.1302 7.0862 7.1611 3.5639 12.6530 7.9159 38.4482 11.0724 9.2713 35.9947 15.0599 32.6349 35.0138 9.5559 41.8452 7.9891 5.8165 23.9273 6.6622 5.8435 6.4655 8.9864 18.0886 1.9810 0.8059 9.5926 13.2502 2.1405 3.3601 12.2521 7.1589 6.0681 10.9311 1.1536 35.7484 94.4640 136.1014 38.1291 34.7732 28.9948 25.3616 49.9102 24.5991 35.8835 59.9985 61.4055 3.7250
temp: 298.150 k
press: 1.00000 atm
elementType: 8 7 6 6 6 6 6 6 6 6 1 1 1 1 1 1 1 1 1 1 1 1 1
symmnumber: 1
zpe: 512159.5 jmol-1
zpe.correction: 0.195071 hartree
zpe.thermalcorrener: 0.205522 hartree
zpe.thermalcorrenthalpy: 0.206467 hartree
zpe.thermalcorrgfe: 0.159503 hartree
zpe.sumelectzpe: -441.742240 hartree
zpe.sumelectthermal: -441.731789 hartree
zpe.sumelectthermalent: -441.730845 hartree
zpe.sumelectthermalfe: -441.777808 hartree
dipole: 0.8094 -0.7190 0.0164
dipole: 1.0828
quadrupole: -66.8062 -54.0622 -61.6544
quadrupole: 2.8709 2.7224 1.0838
quadrupole: -5.9653 6.7787 -0.8134 2.8709 2.7224 1.0838
hfenergy: -441.9373111 hartree
pointgroup: C01 [X(C8H13N1O1)]
dipole: -0.3222688 -0.2785799 -0.0013685 debye
dipolederiv: -0.872973 0.2710248 -0.13896 0.2512465 -0.4114549 -0.1733421 -0.1015771 -0.1807486 -0.4155867 -0.6500226 0.0103423 0.0012969 -0.0542565 -0.5158686 -0.0082569 0.0296424 0.0222207 -0.5393598 0.6217899 -0.1923441 0.0499345 -0.182052 0.4477584 0.0580829 0.0974154 0.0238932 0.3626012 0.016371 0.0283697 0.0033223 0.0673523 -0.0625439 0.037156 -0.0409379 0.0219655 0.1086489 0.0580282 -0.0520209 -0.0040861 -0.025673 0.079556 -0.019373 -0.0132563 0.0096867 0.1330989 0.2235169 -0.1479587 -0.1153225 -0.3010654 0.1887556 -0.0027019 -0.1051915 0.0134859 0.3354307 0.0078039 0.0446303 -0.0619382 0.0930388 0.3966324 -0.1088472 -0.0659728 -0.1012621 0.4463966 0.6658445 0.123069 0.0365131 0.1959889 0.2174325 0.0598902 0.0351001 0.0687216 0.4508166 0.0380596 -0.0864705 -0.0651794 -0.1214121 -0.0386786 0.0191894 -0.064306 -0.0152643 -0.0710653 -0.5261262 0.0078035 0.0370161 0.0754109 -0.3213346 -0.0021964 0.0602472 0.0166371 -0.3343794 -0.0219014 0.0220892 0.0487244 0.0056709 -0.003164 -0.0155584 0.0271774 -0.0197827 -0.2061955 0.0771223 0.0111864 0.0206407 0.032572 0.0514924 -0.0328445 0.072724 0.0008852 -0.1453943 -0.1102762 -0.0994309 -0.074101 -0.0944504 0.0147864 -0.0414713 -0.0972705 -0.0466279 0.0449169 -0.050121 0.0462534 0.0147734 0.0353618 0.0266915 0.0084469 0.1097945 -0.1112608 -0.2313107 0.0405801 -0.0447438 0.0197531 -0.0005981 -0.1854658 0.0705026 0.0132228 0.0982363 0.0303924 0.0197321 0.0168484 0.0248298 0.0147567 0.0839821 -0.0090801 0.0192716 -0.0816805 -0.15613 0.0325218 -0.0120847 -0.0007287 -0.022628 -0.1717473 0.0796184 0.0056239 0.1202676 0.0431859 -0.0769276 0.1119429 0.0056252 0.0977196 0.009087 -0.0062512 0.0313671 -0.0064172 0.0621952 0.0341075 -0.0424794 0.0413757 -0.0354178 -0.0382622 -0.0649047 0.0127258 0.0938689 -0.2846409 -0.0940151 -0.0029064 0.0484066 -0.03282 0.0523053 -0.0175234 -0.1185053 -0.1249262 -0.2239084 0.0065725 0.0536495 0.0038196 -0.0123987 -0.1055902 0.0470699 -0.0039777 0.0730975 0.0652549 0.3294229 -0.0887347 0.0908137 -0.010564 0.0429893 0.1353502 0.0814891 0.1385401 0.2656777 0.2308898 0.0219648 0.0134707 0.0242175 0.2426411 -0.0129552 0.0151938 -0.0135361 0.2593552 unknown
polarizability: 118.8265785|-8.7171002|87.52369|-5.4804108|1.3654815|69.049464 unknown
InChI: InChI=1S/C8H13NO/c1-2-5-9-6-3-4-8(10)7-9/h1,8,10H,3-7H2
charge 0 multiplicity 1
23 atoms
O  3.268515 -1.111925 0.088498
N  -0.419452 -0.264353 0.082905
C  2.036971 -0.378892 0.434495
C  2.199545 1.04313 -0.113731
C  0.894522 1.846316 0.094182
C  0.800267 -1.063777 -0.189467
C  -0.31644 1.099376 -0.498538
C  -1.644484 -0.986529 -0.351018
C  -2.89531 -0.335815 0.085658
C  -3.962091 0.179083 0.426921
H  1.895647 -0.342674 1.536169
H  2.437501 0.969972 -1.193703
H  3.056628 1.535834 0.379196
H  0.992575 -1.19217 -1.286786
H  0.666044 -2.07253 0.250745
H  0.717598 2.007385 1.174749
H  0.981033 2.841221 -0.381571
H  -1.25138 1.640799 -0.270257
H  -0.215507 1.050954 -1.615615
H  -1.684199 -1.109855 -1.465452
H  -1.607123 -2.006618 0.079178
H  3.240928 -2.009148 0.508664
H  -4.887587 0.630915 0.733978
