program: Gaussian 09
title: 000227241
version: EM64L-G09RevD.01
frameworkgroup: C1[X(C9H8ClNO)]
method: RPBEPBE
basis: SDD
operation: Freq
keyword: #p
keyword: freq=noraman
keyword: PBEPBE/SDD
title: #p freq=noraman PBEPBE/SDD
converged: YES YES NO YES
title: Mulliken charges:
elementType: Cl O N C C C C C C C C C H H H H H H H H
charge: -0.059206 -0.263169 -0.471599 0.494964 -0.433824 -0.327891 -0.183336 -0.196834 -0.120543 0.228253 -0.229208 -0.478164 0.225510 0.315783 0.302894 0.255327 0.255692 0.206844 0.226438 0.252071
chargesum: 0.00000
title: Mulliken charges with hydrogens summed into heavy atoms:
elementType: Cl O N C C C C C C C C C
charge: -0.059206 -0.263169 -0.168705 0.494964 -0.208315 -0.012108 0.071990 0.058858 -0.120543 0.228253 -0.022365 0.000344
polarizability: 2.34290662e+02 6.07574436e+00 1.09073633e+02 1.31095950e-04 4.56921452e-03 4.44014963e+01
1716.lowfreq: -7.9878 -0.0031 -0.0026 -0.0004 2.5742 15.1372 47.9145 70.4671 108.1516
frequency: 47.9140 70.4573 108.1497 110.2096 179.1020 228.5513 258.0430 321.3229 333.0601 364.8930 412.0269 442.2085 494.3233 534.7822 617.4559 631.2418 645.3261 687.2168 705.2253 780.7188 814.2586 827.3097 848.7759 910.1746 937.6708 978.5166 984.7255 992.9060 995.3465 1058.1155 1073.3233 1115.6900 1158.6273 1184.9014 1257.2823 1291.7775 1310.4393 1363.2053 1400.3147 1405.9536 1477.6425 1499.4936 1588.9955 1602.3461 1607.5315 1645.9481 3092.9440 3110.0078 3120.5747 3164.8681 3170.8490 3195.3791 3220.1860 3526.4678
redmass: 5.9639 4.9757 5.6186 3.6065 3.4370 5.5074 9.6513 4.2784 4.5085 5.8624 3.0110 7.1754 2.2333 2.0629 6.2098 1.1977 5.1574 4.3770 3.4671 3.5800 1.4026 5.5800 1.4115 4.0941 1.3582 1.2189 1.3120 4.2435 1.2195 1.5989 2.6635 1.3410 2.9420 1.1142 2.1169 1.3029 1.4709 4.3533 4.5203 1.2309 2.3770 2.3130 8.8588 5.4704 4.3962 4.5428 1.0733 1.0800 1.0901 1.0913 1.0953 1.0956 1.1164 1.0762
irintensity: 0.3712 7.1687 1.7114 0.1202 0.3304 1.2528 0.0490 14.7260 0.0030 4.2079 0.0162 13.6900 21.4891 20.1899 0.8908 54.0827 3.9773 14.9217 1.4163 28.9741 42.2637 4.3813 65.0993 10.6183 1.0456 5.6833 2.1198 29.3286 86.9713 8.4763 49.6517 18.4457 77.2630 2.0371 20.8519 17.9796 5.3881 93.7099 11.0216 75.5972 92.3234 396.5964 51.8708 17.5233 41.4020 10.8371 10.3651 10.1925 14.6049 2.5710 2.9682 8.9778 7.3161 13.0396
temp: 298.150 k
press: 1.00000 atm
elementType: 17 8 7 6 6 6 6 6 6 6 6 6 1 1 1 1 1 1 1 1
symmnumber: 1
zpe: 388216.8 jmol-1
zpe.correction: 0.147864 hartree
zpe.thermalcorrener: 0.158873 hartree
zpe.thermalcorrenthalpy: 0.159817 hartree
zpe.thermalcorrgfe: 0.110033 hartree
zpe.sumelectzpe: -936.930953 hartree
zpe.sumelectthermal: -936.919944 hartree
zpe.sumelectthermalent: -936.919000 hartree
zpe.sumelectthermalfe: -936.968784 hartree
dipole: -2.6281 3.9118 0.0008
dipole: 4.7127
quadrupole: -73.7195 -69.2478 -81.6713
quadrupole: -7.6448 0.0021 0.0004
quadrupole: 1.1600 5.6317 -6.7918 -7.6448 0.0021 0.0004
hfenergy: -937.0788169 hartree
pointgroup: C01 [X(C9H8Cl1N1O1)]
dipole: -0.9898184 -1.5678006 -0.0002973 debye
dipolederiv: -0.9867379 -0.112738 -0.0001477 -0.15978 -0.1479759 -0.0000219 -0.0001987 -0.0000236 -0.0695812 -0.6915245 -0.0687179 0.0000449 0.4011851 -0.8644902 0.0003381 0.0004896 -0.000427 -0.3554847 -1.7060918 0.2365155 0.000085 0.3579507 -0.3512138 -0.000073 0.0002336 -0.0000532 -0.3298918 1.0964574 0.0663786 0.0001216 0.3140599 -0.0135002 0.0000425 0.0002309 -0.0000091 0.102106 -0.1455592 -0.0191926 0.00004 0.0536395 0.0687446 0.0000251 -0.0000655 -0.0000177 -0.2041494 -0.176251 0.0024088 0.0000382 -0.0824539 -0.040739 -0.0000387 0.0000257 0.0000093 -0.1566021 -0.2541777 -0.0379817 -0.0000161 -0.2000578 0.0287447 -0.0000234 -0.000015 -0.0000165 -0.0947392 -0.2676741 -0.020946 -0.0000296 0.0575684 0.0705467 -0.0000085 -0.0000466 0.0000019 -0.0972969 1.2551455 0.1980503 0.0002535 0.2629414 0.0736302 0.0000318 0.0002865 0.0000397 -0.0856236 1.7191833 -0.1841499 -0.0002442 -0.7579598 1.0199646 -0.0003326 -0.001362 0.0003982 0.2620063 -0.3086431 -0.065556 0.000014 0.0267661 0.0840553 0.0000089 0.0003932 0.0000356 -0.2192232 -0.0705517 0.0716472 -0.0002541 -0.0410542 0.0523082 0.0000092 0.000064 -0.0000265 -0.2858297 0.0256427 -0.1038213 -0.0000342 -0.0811535 -0.0713851 -0.000006 -0.0000337 -0.0000138 0.1697155 0.1547154 0.0531202 -0.0000332 0.0179725 0.0813854 0.0000056 -0.0000421 0.000003 0.1837075 0.1610178 0.0093953 -0.0000556 -0.0538889 0.0982244 0.0000114 -0.0001657 0.000072 0.3152915 0.021504 0.0763786 -0.0000285 0.0748533 0.0195774 0.0000198 -0.0000272 0.000025 0.1661433 0.0664178 -0.0473821 -0.0000128 -0.0580896 -0.0197858 -0.0000014 -0.0000139 -0.0000021 0.16102 0.0211975 0.0414138 0.0000947 -0.0454022 -0.1314181 -0.0000393 0.0001497 -0.0000384 0.1780947 -0.0611928 -0.0692052 0.000116 -0.0850279 0.0598719 0.000065 0.0000161 0.0000329 0.1728342 0.1471223 -0.0256177 0.0000481 -0.002069 -0.0165453 -0.0000128 0.0000811 0.0000103 0.1875027 unknown
polarizability: 234.5347736|-2.507613|108.8295212|-0.0002609|0.0045636|44.4014963 unknown
InChI: InChI=1S/C9H8ClNO/c1-2-9(12)11-8-5-3-7(10)4-6-8/h2-6,11H,1H2
charge 0 multiplicity 1
20 atoms
Cl 4.742895 0.483963 0.000653
O  -2.215522 1.397191 0.000035
N  -1.194169 -0.724735 -0.000619
C  0.185228 -0.385507 -0.000323
C  1.124337 -1.454207 -0.000074
C  0.653638 0.957487 -0.000273
C  2.509076 -1.196777 0.00022
C  2.04099 1.213832 0.000028
C  2.951549 0.140765 0.000269
C  -2.305515 0.1310 -0.00086
C  -3.613389 -0.597939 -0.00001
C  -4.789815 0.079252 0.000806
H  0.775658 -2.494778 -0.000108
H  -0.068322 1.775682 -0.000487
H  -1.3992 -1.726838 -0.00058
H  3.227764 -2.02117 0.00041
H  2.404477 2.245584 0.000064
H  -3.600118 -1.697397 -0.000085
H  -5.755762 -0.435583 0.00137
H  -4.782799 1.175674 0.000865
