program: Gaussian 09
title: 000227209
version: EM64L-G09RevD.01
frameworkgroup: C1[X(C19H32O7)]
method: RPBEPBE
basis: SDD
operation: Freq
keyword: #pfreq=noraman
keyword: PBEPBE/SDD
title: #p freq=noraman PBEPBE/SDD
converged: YES YES NO NO
title: Mulliken charges:
elementType: O O O O O O O C C C C C C C C C C C C C C C C C C C H H H H H H H H H H H H H H H H H H H H H H H H H H H H H H H H
charge: -0.279167 -0.277562 -0.286664 -0.288819 -0.267124 -0.258392 -0.253381 -0.005393 -0.429940 -0.433267 -0.482482 0.003677 -0.479055 -0.456134 -0.430858 -0.291212 0.006130 -0.445257 -0.408584 -0.299563 0.307534 0.288606 -0.781969 -0.761675 0.320601 -0.777610 0.204267 0.205659 0.211973 0.197438 0.263614 0.232188 0.215526 0.262259 0.212787 0.220162 0.226893 0.225386 0.245626 0.206708 0.221975 0.190969 0.292067 0.228124 0.215139 0.219786 0.210036 0.239707 0.241689 0.296148 0.237426 0.237523 0.248035 0.246869 0.247558 0.305983 0.236693 0.221347
chargesum: 0.00000
title: Mulliken charges with hydrogens summed into heavy atoms:
elementType: O O O O O O O C C C C C C C C C C C C C C C C C C C
charge: -0.279167 -0.277562 -0.286664 -0.288819 -0.267124 -0.258392 -0.253381 0.198874 -0.012308 0.027785 -0.034767 0.265936 -0.046106 -0.003855 0.021476 0.121732 0.298197 -0.001995 0.021238 0.181833 0.307534 0.288606 -0.010872 -0.019212 0.320601 -0.013587
polarizability: 2.58033018e+02 -9.54817173e+00 2.03123962e+02 1.71327047e+00 6.27562577e+00 2.11690825e+02
1716.lowfreq: -30.9849 -10.0379 -7.7238 -0.7368 -0.0012 -0.0008 -0.0008 6.1154 20.3350
frequency: -29.2898 -4.4880 20.0297 23.2923 28.9497 35.0379 41.2452 50.4122 53.1525 58.3437 72.8308 75.5514 87.5221 94.1089 101.4900 114.6360 134.3102 139.5727 154.5832 156.5781 160.2823 186.1096 199.7730 205.1346 224.6088 234.5199 238.7243 247.3104 271.9383 302.9815 326.0757 370.6537 383.3347 404.8912 407.9791 426.7795 436.2192 459.8415 494.9977 531.8334 555.3907 564.9708 569.6332 571.9082 577.7310 604.6233 612.9778 622.8121 639.1201 713.3382 733.0139 753.3125 787.1197 801.0479 822.5426 850.3071 854.6745 865.4368 876.1274 890.3183 902.5318 911.9409 923.3650 924.6762 936.3269 956.0527 984.3834 995.8279 998.9619 1003.4864 1005.7336 1021.7815 1025.9419 1041.0156 1042.9106 1050.8347 1052.9432 1054.2052 1057.8330 1083.2194 1093.1224 1108.3664 1125.1589 1134.8374 1144.7015 1146.7916 1166.3260 1171.5797 1176.0358 1192.7366 1199.8784 1205.4238 1214.7804 1217.6080 1229.5338 1247.4523 1251.5849 1280.4028 1282.1454 1283.9272 1305.0426 1308.1642 1311.7267 1318.2152 1325.4120 1332.0623 1338.6100 1346.6507 1353.9209 1359.3448 1366.1290 1371.9074 1375.6245 1382.1817 1384.7071 1385.5351 1385.5833 1444.2347 1448.9574 1453.3648 1453.9744 1455.1856 1455.9952 1458.0329 1460.1664 1460.6476 1463.4878 1466.2336 1466.7843 1468.0144 1474.3944 1487.7589 1491.6083 1633.0486 1637.4478 1655.3506 2951.1800 2960.5987 2963.4897 2982.5999 2986.2274 2990.0444 2996.6048 2997.2471 2999.4441 3000.7921 3001.9160 3004.9505 3005.4798 3006.5730 3011.0160 3021.8150 3037.2356 3042.4068 3048.5036 3061.6509 3064.9209 3065.8801 3070.8738 3072.2011 3073.5321 3087.1870 3092.5537 3098.5801 3098.6742 3134.1807 3138.5146 3138.7535
redmass: 4.0638 5.0800 3.6700 3.9465 5.3824 7.3259 7.9136 4.9393 1.4329 2.5404 3.7003 5.4218 4.1614 3.3671 3.6643 3.8687 3.4598 3.2497 1.0874 1.0699 3.2782 3.3906 3.2413 2.6019 3.1221 2.6004 2.0108 2.5947 3.1464 3.3050 3.5115 2.9500 3.0960 2.5001 3.0339 2.6582 3.1600 2.9456 2.8086 3.0410 2.7974 3.2947 2.8361 2.7618 3.3461 4.5957 4.1466 3.9656 3.6309 1.7754 1.9962 1.8670 3.2124 1.8631 2.5144 3.5279 2.0309 2.6236 2.7533 1.6934 2.3847 4.2114 2.5967 3.0023 3.9443 2.2112 2.0278 1.7954 1.8373 1.8321 2.1873 2.1695 2.2018 2.8900 1.6993 1.9219 1.6755 1.6607 2.2392 2.3607 2.0267 1.9629 2.1348 1.9546 1.8858 1.8891 1.4589 1.3654 1.5154 2.5268 1.7715 1.9593 2.6786 1.4870 1.3317 1.3018 1.2895 1.2390 1.3059 1.2042 1.2190 1.2001 1.3344 1.2884 1.2575 1.2454 1.2799 1.4746 1.3584 1.3657 1.6128 1.4679 1.2804 1.3065 1.2609 1.3240 1.3427 1.0853 1.0828 1.0615 1.0550 1.0537 1.0545 1.0913 1.0844 1.0815 1.0734 1.0793 1.0664 1.0955 1.0930 1.0784 1.0911 9.3750 9.2879 9.6768 1.0832 1.0683 1.0601 1.0656 1.0604 1.0609 1.0627 1.0378 1.0606 1.0616 1.0378 1.0383 1.0836 1.0623 1.0623 1.0978 1.0866 1.0999 1.0971 1.0972 1.1003 1.1001 1.1008 1.1002 1.1057 1.1057 1.0951 1.0941 1.0946 1.1014 1.1022 1.1024
irintensity: 4.6109 0.0541 0.1054 0.1186 0.7403 1.0867 0.6236 3.4270 0.7365 0.3218 3.3101 1.3089 2.7057 0.7117 3.9788 1.2172 4.1759 2.7067 0.7594 0.4011 4.2036 3.0889 4.9181 1.7787 9.6799 7.4316 2.8254 3.3649 1.9913 9.1889 7.5166 2.8981 6.0828 2.8086 0.8616 0.8972 4.7345 0.5419 3.5944 3.9657 0.8561 2.7243 4.7233 1.7271 10.6725 6.1185 2.8917 4.9277 3.7248 7.8654 3.6026 3.5439 8.3768 14.4951 7.2115 4.8700 14.1125 10.9821 11.7951 7.3740 3.5343 22.7342 4.2581 75.7282 97.5188 31.0635 88.6476 31.0149 36.3646 79.3572 11.4505 6.1943 17.3844 21.5008 10.0195 2.4971 14.1540 24.8505 26.8714 14.3079 3.1422 2.0507 12.1129 3.2929 5.8953 2.4817 6.8953 3.4890 62.6469 190.8033 139.5227 35.1840 402.7522 87.9006 9.6895 0.9824 4.6375 6.6045 1.9583 3.5611 2.9301 0.2703 1.2501 2.4294 13.2791 2.1793 0.3473 1.4289 7.1234 0.4620 2.2809 4.8501 8.0797 17.0414 105.6896 33.2066 3.4933 3.6876 7.9485 21.4186 7.2524 6.3168 16.9366 21.6367 6.2684 12.8069 30.9606 6.8098 34.1312 7.4132 9.7877 15.1162 1.4748 178.0178 187.9798 207.3729 49.4014 47.8414 28.0544 17.3386 18.7602 23.0498 29.9361 17.6800 15.5332 53.5689 8.8452 2.9382 9.6506 16.8600 29.2008 39.3543 3.7119 25.2568 15.2114 47.2710 27.8082 31.0459 24.5692 29.7033 49.0725 63.1381 10.5435 6.5730 7.0879 12.7740 8.8669 8.7684
temp: 298.150 k
press: 1.00000 atm
elementType: 8 8 8 8 8 8 8 6 6 6 6 6 6 6 6 6 6 6 6 6 6 6 6 6 6 6 1 1 1 1 1 1 1 1 1 1 1 1 1 1 1 1 1 1 1 1 1 1 1 1 1 1 1 1 1 1 1 1
symmnumber: 1
zpe: 1283351.0 jmol-1
zpe.correction: 0.488803 hartree
zpe.thermalcorrener: 0.517439 hartree
zpe.thermalcorrenthalpy: 0.518383 hartree
zpe.thermalcorrgfe: 0.426109 hartree
zpe.sumelectzpe: -1267.735624 hartree
zpe.sumelectthermal: -1267.706988 hartree
zpe.sumelectthermalent: -1267.706044 hartree
zpe.sumelectthermalfe: -1267.798318 hartree
dipole: -1.1745 -2.5402 -5.6177
dipole: 6.2762
quadrupole: -126.1669 -164.5849 -159.5904
quadrupole: -6.0549 0.8289 -7.5363
quadrupole: 23.9472 -14.4709 -9.4763 -6.0549 0.8289 -7.5363
hfenergy: -1268.2244264 hartree
pointgroup: C01 [X(C19H32O7)]
dipole: -0.4110176 0.3530094 2.4090719 debye
polarizability: 257.7750976|10.5122743|200.7463602|-0.1011507|2.8669605|214.3263476 unknown
InChI: InChI=1S/C19H32O7/c1-14(20)23-12-5-7-18(25-15(2)21)10-11-19(26-16(3)22)9-8-17-6-4-13-24-17/h17-19H,4-13H2,1-3H3
charge 0 multiplicity 1
58 atoms
O  -4.606465 0.490712 -0.459764
O  0.268991 2.236896 -0.467655
O  3.776082 0.051171 1.242234
O  0.624111 -2.443155 -0.464148
O  0.093166 0.722929 -2.233872
O  3.856396 1.305057 -0.726524
O  0.840892 -3.341991 -2.604344
C  -4.303985 0.75425 0.98318
C  -2.795301 0.58556 1.221644
C  -1.953659 1.584003 0.393044
C  -5.202256 -0.219317 1.784982
C  -0.447152 1.277898 0.443736
C  0.200503 1.461807 1.828638
C  -6.404885 -0.456669 0.837448
C  1.745011 1.325582 1.833822
C  -5.718194 -0.488489 -0.543109
C  2.265718 0.026702 1.184616
C  1.83324 -1.259748 1.8970
C  2.357459 -2.569759 1.261761
C  2.074559 -2.715941 -0.236943
C  0.516684 1.811707 -1.777278
C  4.441187 0.745139 0.231626
C  1.389107 2.803254 -2.506805
C  5.936037 0.740293 0.470775
C  0.138105 -2.760896 -1.748469
C  -1.277821 -2.269582 -1.921891
H  -4.599661 1.806899 1.181233
H  -2.516491 -0.453827 0.951925
H  -2.59622 0.710625 2.305574
H  -2.130264 2.618677 0.749577
H  -2.293706 1.529962 -0.657102
H  -5.50055 0.196709 2.762299
H  -4.663285 -1.17002 1.962493
H  -0.272833 0.256557 0.052118
H  -0.06424 2.464883 2.216323
H  -0.251605 0.723879 2.518557
H  -6.953191 -1.38789 1.06169
H  -7.11312 0.389866 0.89593
H  2.173518 2.181791 1.283453
H  2.111312 1.374697 2.87772
H  -6.373309 -0.17756 -1.374801
H  -5.307358 -1.496265 -0.76236
H  1.989041 0.00482 0.115582
H  0.728631 -1.286228 1.891389
H  2.155623 -1.212926 2.955589
H  3.453852 -2.637294 1.398373
H  1.908211 -3.424764 1.801806
H  2.648923 -1.99598 -0.849242
H  2.310178 -3.731356 -0.601776
H  2.4399 2.59261 -2.233491
H  1.154736 3.835706 -2.203139
H  1.269588 2.681017 -3.593623
H  6.203701 1.58971 1.125975
H  6.465562 0.862842 -0.486134
H  6.253498 -0.186664 0.972946
H  -1.233062 -1.197724 -2.190717
H  -1.769005 -2.824951 -2.734754
H  -1.852904 -2.364312 -0.986416
