program: Gaussian 09
title: 000227203
version: EM64L-G09RevD.01
frameworkgroup: C1[X(C16H30O3)]
method: RPBEPBE
basis: SDD
operation: Freq
keyword: #pfreq=noraman
keyword: PBEPBE/SDD
title: #p freq=noraman PBEPBE/SDD
converged: YES YES NO NO
title: Mulliken charges:
elementType: O O O C C C C C C C C C C C C C C C C H H H H H H H H H H H H H H H H H H H H H H H H H H H H H H
charge: -0.269679 -0.263778 -0.245373 -0.015408 -0.476363 -0.390305 -0.458848 -0.307700 -0.405827 -0.321458 -0.373492 -0.369385 -0.367862 -0.383185 -0.357439 -0.504863 -0.353185 0.257486 -0.695062 0.198636 0.237434 0.213670 0.215962 0.218280 0.219677 0.228055 0.196406 0.220100 0.201389 0.254641 0.218450 0.236422 0.194042 0.188467 0.194670 0.199022 0.181303 0.196438 0.202861 0.224493 0.191164 0.186023 0.232585 0.229427 0.197101 0.187932 0.210641 0.210698 0.215741
chargesum: 0.00000
title: Mulliken charges with hydrogens summed into heavy atoms:
elementType: O O O C C C C C C C C C C C C C C C C
charge: -0.269679 -0.263778 -0.245373 0.183228 -0.025259 0.043937 -0.011117 0.108806 0.050203 0.133414 0.009016 0.024307 0.009878 0.044169 0.019748 -0.042852 0.031848 0.257486 -0.057982
polarizability: 2.06419548e+02 6.57612009e-01 1.80936238e+02 -2.42340979e+00 5.72480572e-01 1.51714003e+02
1716.lowfreq: -10.0010 -7.1471 -4.4894 -0.0006 0.0000 0.0005 16.9247 22.5143 33.4630
frequency: 14.7425 22.4803 33.3640 38.2639 45.7609 49.6353 61.9694 68.2964 77.2035 94.1085 102.0419 122.5188 138.4886 148.6596 158.5538 185.5821 211.4275 225.3840 228.4894 245.5640 271.0171 311.6808 341.7889 364.5204 388.7306 422.1748 456.1566 473.5193 507.2375 570.3644 591.3058 644.0436 646.4164 718.8510 728.1904 737.1526 757.7285 784.7549 808.4336 822.3401 850.3677 856.4109 860.5755 873.1630 891.1235 894.9302 908.5851 919.1679 929.2098 976.6482 990.1030 998.9527 1012.4265 1018.8305 1027.5270 1040.4874 1046.2151 1051.8692 1071.8254 1081.6782 1087.0946 1107.2300 1109.2619 1116.3008 1130.3018 1154.1710 1164.8494 1171.8102 1191.0829 1196.3371 1209.4710 1225.3248 1233.7842 1236.1567 1238.9044 1269.7560 1270.9867 1278.5396 1281.6729 1282.3441 1289.7104 1290.7072 1295.2537 1309.1040 1316.2681 1318.6350 1322.8878 1337.8283 1347.4048 1350.3991 1355.1095 1360.3943 1362.9316 1365.9301 1388.3244 1446.5906 1447.4676 1456.9778 1458.8230 1459.4662 1461.5519 1462.7950 1467.4601 1468.3781 1474.5714 1476.2527 1476.5803 1482.3364 1487.7467 1493.8317 1635.7676 2947.8048 2949.1278 2949.6257 2952.7763 2958.2602 2959.1071 2963.6555 2972.0025 2973.5327 2982.2534 2984.6978 2988.9279 2990.5234 2994.7585 3001.5727 3002.2608 3009.0023 3018.5320 3021.5906 3033.6687 3033.9806 3053.1728 3058.1961 3061.6937 3068.1355 3070.8939 3071.2431 3080.0529 3084.8346 3099.3646
redmass: 3.8837 3.6915 3.2612 4.9492 1.8663 5.1343 2.3532 3.4426 4.0323 2.4745 2.2122 2.8271 3.3869 1.9097 2.4809 2.5699 3.1824 1.3747 2.4355 1.8166 3.5915 2.3718 2.7981 2.9234 3.2045 3.0700 2.8557 2.8232 2.8835 2.1062 3.4634 3.1229 2.8732 1.0676 1.1253 2.6599 1.2307 1.5780 2.8177 1.4163 2.0072 2.3931 2.3299 1.8453 1.8542 1.6455 1.6997 2.3312 1.8235 1.8624 2.2107 1.6925 3.2467 2.7297 1.8925 2.4870 1.9072 2.2663 2.4627 2.1674 2.5084 2.1336 1.9656 2.3140 1.8513 1.6404 1.4639 1.9718 1.5617 1.4667 1.8008 1.3282 1.3023 1.2729 1.3671 1.2358 1.2480 1.2783 1.1699 1.0401 1.2374 1.1499 1.1016 1.2243 1.3310 1.3491 1.2992 1.2934 1.4666 1.4264 1.6716 1.3980 1.5608 1.4462 1.2168 1.0987 1.0857 1.0760 1.0782 1.0826 1.0819 1.0764 1.0807 1.0930 1.0809 1.0528 1.0803 1.0857 1.0889 1.0927 9.6230 1.0595 1.0595 1.0679 1.0597 1.0600 1.0851 1.0602 1.0360 1.0631 1.0944 1.0654 1.0603 1.0958 1.0639 1.0901 1.0722 1.0614 1.1033 1.0612 1.0963 1.1011 1.1024 1.1022 1.0961 1.1005 1.0993 1.1004 1.0987 1.1047 1.1081
irintensity: 0.0403 0.2657 0.7009 2.7530 0.7222 1.3244 0.1264 1.3686 0.6798 0.8766 0.6192 0.1793 0.7178 0.0752 2.0420 0.2120 3.0815 0.3811 0.5823 2.2828 1.4465 5.4174 4.2111 5.2690 9.0946 3.0389 0.1246 1.3002 3.0315 3.5522 2.7695 4.1769 3.6048 16.3113 0.1061 8.5236 6.1532 2.2588 7.2274 2.9123 9.7700 12.8399 4.1317 8.9903 2.8261 5.5125 6.2235 8.8005 30.7638 4.8806 4.9719 24.8946 60.8776 8.2604 8.1332 6.3109 24.9619 64.3824 16.5848 0.4859 10.3297 37.2986 11.6363 6.0925 4.9086 2.2908 6.1109 38.2900 2.0520 4.4430 84.6776 7.6979 2.1765 13.7315 34.0015 0.3466 4.9373 5.6600 5.7249 0.0986 3.3820 0.6901 0.2379 2.2015 0.7627 2.0746 0.3724 0.6307 0.5656 14.0216 1.6340 1.6306 2.1334 0.9625 11.6878 15.1401 16.0744 3.3075 0.5216 4.8115 3.0577 6.7029 4.1974 9.0572 7.1070 7.7564 10.9914 3.1644 25.1521 0.9888 171.8831 3.8407 4.9256 108.8739 3.0226 3.0518 20.4104 150.5677 38.8463 20.2843 8.7458 37.2760 32.4091 4.8242 30.3388 7.0566 24.6727 26.6428 1.0938 39.7896 35.3378 117.0288 83.2033 59.1774 35.0688 98.6439 44.0290 18.4605 32.6079 77.7648 17.9807
temp: 298.150 k
press: 1.00000 atm
elementType: 8 8 8 6 6 6 6 6 6 6 6 6 6 6 6 6 6 6 6 1 1 1 1 1 1 1 1 1 1 1 1 1 1 1 1 1 1 1 1 1 1 1 1 1 1 1 1 1 1
symmnumber: 1
zpe: 1141698.9 jmol-1
zpe.correction: 0.434850 hartree
zpe.thermalcorrener: 0.457664 hartree
zpe.thermalcorrenthalpy: 0.458608 hartree
zpe.thermalcorrgfe: 0.378512 hartree
zpe.sumelectzpe: -851.812802 hartree
zpe.sumelectthermal: -851.789988 hartree
zpe.sumelectthermalent: -851.789044 hartree
zpe.sumelectthermalfe: -851.869140 hartree
dipole: 1.0936 -0.4860 0.2060
dipole: 1.2143
quadrupole: -119.7918 -113.8222 -127.1864
quadrupole: -4.6154 9.7019 8.0765
quadrupole: 0.4750 6.4446 -6.9196 -4.6154 9.7019 8.0765
hfenergy: -852.2476523 hartree
pointgroup: C01 [X(C16H30O3)]
dipole: 0.4345435 -0.1884816 0.0623645 debye
polarizability: 206.3433622|1.3948179|180.6879266|-2.7455664|2.9132537|152.0384998 unknown
InChI: InChI=1S/C16H30O3/c1-2-3-4-5-6-7-12-16(17)19-14-9-11-15-10-8-13-18-15/h15H,2-14H2,1H3
charge 0 multiplicity 1
49 atoms
O  0.813811 3.071314 -0.864013
O  -3.270191 -0.403013 -0.687969
O  -3.722936 -1.181871 1.46425
C  -0.274157 2.811164 0.131949
C  0.411536 2.123594 1.343777
C  -1.38246 1.987899 -0.544675
C  1.895306 2.554544 1.218793
C  2.092651 2.572073 -0.309657
C  -2.603326 1.763418 0.375705
C  -3.732283 0.961894 -0.287616
C  1.071557 -2.083391 -0.702751
C  -0.286865 -2.241902 0.016301
C  2.224573 -1.688736 0.247357
C  -1.430398 -2.639837 -0.942904
C  3.571842 -1.471376 -0.477361
C  -2.815012 -2.725416 -0.249063
C  4.712152 -1.031722 0.469105
C  -3.308255 -1.394845 0.300935
C  6.055441 -0.816935 -0.261078
H  -0.672234 3.805857 0.424382
H  -0.038436 2.419957 2.30617
H  0.325621 1.023499 1.250141
H  -1.699009 2.515637 -1.465557
H  -0.96245 1.014537 -0.862408
H  2.587438 1.862739 1.73055
H  2.03954 3.567969 1.635591
H  2.298654 1.550619 -0.696172
H  2.888855 3.254912 -0.651729
H  -3.028659 2.744009 0.676615
H  -2.306115 1.248265 1.308286
H  -4.049434 1.414669 -1.24193
H  -4.593401 0.853238 0.395632
H  0.972843 -1.314271 -1.497498
H  1.32922 -3.031755 -1.219239
H  -0.542873 -1.285369 0.518342
H  -0.196271 -2.999233 0.822424
H  1.948594 -0.758149 0.787933
H  2.346757 -2.470955 1.025476
H  -1.204336 -3.626544 -1.393968
H  -1.492508 -1.911283 -1.772742
H  3.867022 -2.407487 -0.995849
H  3.441852 -0.706192 -1.271966
H  -3.56643 -3.087194 -0.977976
H  -2.792728 -3.437449 0.594125
H  4.839853 -1.79334 1.265455
H  4.415622 -0.093321 0.983152
H  5.96341 -0.036268 -1.039722
H  6.388557 -1.747354 -0.758519
H  6.852359 -0.5044 0.438616
