program: Gaussian 09
title: 000227199
version: EM64L-G09RevD.01
frameworkgroup: C1[X(C15H28O3)]
method: RPBEPBE
basis: SDD
operation: Freq
keyword: #pfreq=noraman
keyword: PBEPBE/SDD
title: #p freq=noraman PBEPBE/SDD
converged: YES YES NO NO
title: Mulliken charges:
elementType: O O O C C C C C C C C C C C C C C C H H H H H H H H H H H H H H H H H H H H H H H H H H H H
charge: -0.270300 -0.262812 -0.245147 -0.014462 -0.475751 -0.388103 -0.458306 -0.304229 -0.408439 -0.321980 -0.368551 -0.362926 -0.385699 -0.350131 -0.503325 -0.357338 0.258405 -0.694324 0.197610 0.237440 0.214254 0.217523 0.215848 0.219838 0.227279 0.193460 0.219666 0.255543 0.201645 0.218989 0.236103 0.197745 0.195771 0.190733 0.186209 0.223988 0.204525 0.180954 0.193624 0.227860 0.232340 0.192488 0.198102 0.211934 0.203976 0.217974
chargesum: 0.00000
title: Mulliken charges with hydrogens summed into heavy atoms:
elementType: O O O C C C C C C C C C C C C C C C
charge: -0.270300 -0.262812 -0.245147 0.183148 -0.024057 0.045267 -0.011189 0.108896 0.048749 0.133112 0.024964 0.014016 0.042813 0.024447 -0.043125 0.033252 0.258405 -0.060440
polarizability: 1.89506751e+02 -1.61849898e+00 1.71921990e+02 -1.49266312e+00 1.09566890e+00 1.43621990e+02
1716.lowfreq: -21.3622 -6.0348 -0.0010 -0.0010 -0.0008 6.7639 7.6811 28.9779 34.4273
frequency: -15.8761 28.8854 34.2403 40.5799 42.5028 52.4839 61.0183 74.9763 88.7553 104.6288 107.8007 130.5284 141.3004 165.1943 204.1701 219.8740 227.1789 230.8751 245.8442 294.2458 332.0149 361.5478 388.2823 405.8011 430.4580 474.9330 506.2345 567.3478 595.7570 643.9555 655.5802 719.7261 733.7395 738.4899 779.4657 793.6486 810.5990 849.1726 854.4686 859.6725 862.3225 886.8902 894.4695 903.3918 917.7618 925.9797 968.5117 992.3100 995.5385 1011.2111 1026.5750 1029.8211 1038.5069 1049.2211 1063.8684 1079.3106 1086.3044 1100.0426 1111.0490 1114.3526 1130.9423 1155.8427 1165.6014 1171.6375 1196.3823 1199.5871 1211.2346 1225.6741 1235.5910 1244.6388 1247.2678 1271.8193 1280.3124 1284.7190 1285.6712 1289.4555 1291.1112 1296.8191 1308.9509 1315.0439 1320.2515 1334.1250 1337.5176 1352.0476 1352.7583 1357.2029 1361.4179 1365.7287 1385.9635 1448.2978 1449.0846 1457.2838 1458.3406 1459.9910 1462.0580 1464.7008 1467.5888 1472.2996 1475.3349 1477.8157 1480.5394 1487.6375 1490.1697 1636.6074 2948.8347 2950.2083 2951.5254 2957.6243 2958.8163 2965.6869 2969.2633 2974.6208 2984.1896 2985.6134 2989.7300 2992.8058 2996.5065 3004.9116 3008.1696 3013.8449 3020.9213 3031.3578 3033.7028 3051.7784 3058.7680 3060.4926 3063.9219 3070.6454 3071.5738 3081.3951 3084.1959 3099.2354
redmass: 2.8728 3.8294 3.0934 3.3092 3.3502 3.5994 2.6804 3.2482 3.8442 3.2236 1.7046 2.9099 2.9716 2.4041 2.4467 4.4714 1.1566 1.7684 2.9619 2.7895 3.0129 2.8663 2.9732 2.7671 3.0360 2.8712 2.7625 2.1074 3.4569 3.8589 2.4443 1.0781 1.2851 2.2433 1.4143 1.4846 2.8981 2.0214 2.4006 2.3752 1.6166 1.5941 1.7367 1.9355 2.2356 1.9986 1.5485 2.6460 1.7888 3.3885 2.3086 1.8585 2.2402 2.2027 2.3583 2.2927 2.5090 2.0991 1.8427 2.2022 1.8518 1.6974 1.4773 1.9840 1.5164 1.4660 1.8337 1.3309 1.1938 1.3714 1.3228 1.2255 1.1242 1.1731 1.1329 1.2320 1.2215 1.1616 1.2207 1.3419 1.3016 1.4008 1.2977 1.4717 1.5243 1.4933 1.4232 1.5321 1.2163 1.0973 1.0890 1.0737 1.0823 1.0781 1.0789 1.0825 1.0895 1.0756 1.0439 1.0901 1.0819 1.0913 1.0916 9.5754 1.0588 1.0687 1.0590 1.0845 1.0595 1.0599 1.0366 1.0627 1.0917 1.0653 1.0604 1.0639 1.0982 1.0619 1.0614 1.1021 1.0612 1.1037 1.0940 1.1032 1.1019 1.0967 1.1002 1.1004 1.0995 1.0999 1.1047 1.1078
irintensity: 0.1683 0.7091 0.4999 1.1083 1.8523 0.9960 1.8187 0.8793 0.5883 0.9390 0.1973 0.2382 0.6850 2.4656 0.8947 2.6411 0.1535 2.3782 0.1946 3.3437 7.5180 4.6401 9.1415 0.4817 3.5677 1.0975 2.5352 3.4212 2.6160 4.7830 3.4231 15.2356 1.1166 7.9131 5.7149 1.0181 10.4929 9.4132 8.7730 6.3091 5.8235 8.5004 1.3992 9.4868 11.4693 15.0186 19.4044 0.3147 24.1166 61.0880 2.0364 3.2983 45.4788 41.8387 29.8265 4.1056 10.9088 38.9857 3.9992 6.6593 6.1914 2.1629 5.3752 47.0957 2.7994 3.8632 87.1439 8.8275 12.2479 19.9050 12.0064 3.0918 1.4681 7.5506 0.7802 1.6745 3.1254 2.6202 3.0186 0.3016 0.7233 2.2584 0.6731 11.9016 2.6769 1.5052 1.3835 1.8116 12.1245 17.3733 13.3996 3.0685 4.1352 3.4037 2.5257 7.2565 7.8809 2.3285 11.0889 16.7865 1.0779 22.9725 0.5748 167.1957 2.0085 112.7934 1.6164 17.7037 19.2480 96.5853 34.7169 19.6441 13.8711 37.4218 28.0936 32.2635 2.3992 24.5452 26.6247 1.5609 39.7891 87.5342 5.5073 80.9190 65.0179 38.6246 121.0737 13.8202 50.8607 29.9286 75.8527 19.0214
temp: 298.150 k
press: 1.00000 atm
elementType: 8 8 8 6 6 6 6 6 6 6 6 6 6 6 6 6 6 6 1 1 1 1 1 1 1 1 1 1 1 1 1 1 1 1 1 1 1 1 1 1 1 1 1 1 1 1
symmnumber: 1
zpe: 1068246.2 jmol-1
zpe.correction: 0.406873 hartree
zpe.thermalcorrener: 0.427440 hartree
zpe.thermalcorrenthalpy: 0.428384 hartree
zpe.thermalcorrgfe: 0.354988 hartree
zpe.sumelectzpe: -812.589860 hartree
zpe.sumelectthermal: -812.569294 hartree
zpe.sumelectthermalent: -812.568350 hartree
zpe.sumelectthermalfe: -812.641745 hartree
dipole: 1.0426 -0.5124 0.1295
dipole: 1.1689
quadrupole: -112.0274 -106.6977 -121.1782
quadrupole: -4.2262 9.1107 8.1319
quadrupole: 1.2737 6.6034 -7.8771 -4.2262 9.1107 8.1319
hfenergy: -812.9967333 hartree
pointgroup: C01 [X(C15H28O3)]
dipole: 0.3961217 0.2292468 -0.0450478 debye
polarizability: 189.2661194|2.6727072|172.0125021|0.9562192|2.5349313|143.7721093 unknown
InChI: InChI=1S/C15H28O3/c1-2-3-4-5-6-11-15(16)18-13-8-10-14-9-7-12-17-14/h14H,2-13H2,1H3
charge 0 multiplicity 1
46 atoms
O  1.604479 -2.762903 0.994813
O  -3.037073 -0.126485 0.651939
O  -3.449664 0.618486 -1.520459
C  0.537319 -2.708924 -0.054932
C  1.144091 -1.907443 -1.237227
C  -0.733042 -2.105278 0.564584
C  2.672259 -2.088944 -1.053168
C  2.811554 -2.073988 0.481748
C  -1.929864 -2.104683 -0.412889
C  -3.219929 -1.539603 0.198683
C  -0.3570 2.251902 -0.016409
C  1.014331 2.310319 0.693472
C  -1.543662 2.380506 0.964729
C  2.212271 2.205472 -0.277281
C  -2.929984 2.244304 0.279293
C  3.58295 2.216044 0.437244
C  -3.165675 0.868796 -0.325786
C  4.772546 2.085909 -0.538472
H  0.343279 -3.759455 -0.359596
H  0.786996 -2.266497 -2.217176
H  0.872498 -0.837663 -1.145124
H  -0.511874 -1.073137 0.897403
H  -0.989867 -2.685104 1.472681
H  3.261367 -1.2930 -1.541932
H  2.995628 -3.064828 -1.458877
H  2.842451 -1.032292 0.867263
H  3.691208 -2.624264 0.857056
H  -1.691456 -1.531195 -1.328118
H  -2.147803 -3.144133 -0.736795
H  -3.500388 -2.069759 1.124114
H  -4.048749 -1.568547 -0.531058
H  -0.417162 3.055455 -0.779273
H  -0.436555 1.293837 -0.571607
H  1.073384 1.488331 1.43783
H  1.091639 3.256354 1.269463
H  -1.460224 1.611668 1.755681
H  -1.498045 3.367356 1.466736
H  2.120771 1.272242 -0.873308
H  2.171671 3.041286 -1.006525
H  -3.042456 2.984065 -0.532047
H  -3.72507 2.429568 1.026856
H  3.614976 1.387401 1.174729
H  3.682605 3.153621 1.021252
H  4.776771 2.914994 -1.270972
H  4.716504 1.137784 -1.107591
H  5.740196 2.101427 -0.004148
