program: Gaussian 09
title: 000227198
version: EM64L-G09RevD.01
frameworkgroup: C1[X(C15H28O3)]
method: RPBEPBE
basis: SDD
operation: Freq
keyword: #pfreq=noraman
keyword: PBEPBE/SDD
title: #p freq=noraman PBEPBE/SDD
converged: YES YES NO NO
title: Mulliken charges:
elementType: O O O C C C C C C C C C C C C C C C H H H H H H H H H H H H H H H H H H H H H H H H H H H H
charge: -0.269980 -0.263588 -0.249430 -0.015076 -0.478264 -0.394276 -0.459565 -0.303347 -0.410972 -0.132367 -0.421188 -0.327476 -0.344920 -0.399676 0.220687 -0.356160 -0.702746 -0.704822 0.198979 0.236717 0.214692 0.224580 0.215301 0.221021 0.227664 0.192606 0.219820 0.256224 0.203864 0.228878 0.194493 0.217375 0.220120 0.235165 0.190730 0.194254 0.222933 0.204241 0.193269 0.200776 0.216137 0.213196 0.228272 0.211052 0.212257 0.218554
chargesum: 0.00000
title: Mulliken charges with hydrogens summed into heavy atoms:
elementType: O O O C C C C C C C C C C C C C C C
charge: -0.269980 -0.263588 -0.249430 0.183902 -0.026856 0.045605 -0.010880 0.109079 0.049115 0.096511 -0.009321 0.127809 0.040064 0.027498 0.220687 0.037885 -0.045141 -0.062959
polarizability: 1.92329616e+02 -3.55455321e+00 1.74782908e+02 6.65284667e-01 -3.62986003e-01 1.40769402e+02
1716.lowfreq: -14.3516 -4.5285 0.0006 0.0007 0.0008 5.0690 18.1925 28.1841 33.6617
frequency: 13.8861 27.8253 33.3552 36.6939 52.8342 60.9798 62.9759 81.0827 94.3546 99.9496 120.4807 138.9173 165.7931 171.6019 210.2473 223.7197 228.5656 238.9805 242.9592 259.8542 295.4605 329.7459 360.5717 379.4306 415.5851 438.9761 494.6536 518.7748 570.6640 622.4822 644.9961 707.4301 729.3828 747.6448 773.8430 784.2445 804.5889 831.5690 847.3745 853.2235 860.5828 885.0706 896.6137 910.3591 916.3688 922.4757 944.8371 985.3093 996.2901 1011.7168 1027.3512 1034.9704 1046.2343 1049.6033 1072.2528 1083.2166 1089.6920 1099.1495 1101.5077 1108.8404 1124.0392 1130.2718 1147.2625 1154.7054 1164.6689 1197.9888 1210.6543 1225.9116 1237.6275 1239.0459 1258.9194 1271.3649 1275.4607 1285.1230 1288.7541 1289.5531 1295.7626 1308.4277 1316.1439 1325.7516 1329.2671 1336.9490 1348.7110 1354.0732 1355.4284 1366.7271 1370.3650 1387.5368 1394.2106 1446.5871 1455.7775 1458.1294 1462.9890 1463.9834 1465.8804 1467.5080 1475.9595 1476.6874 1477.6491 1480.6748 1483.9358 1485.6984 1492.5192 1630.3847 2951.9504 2957.0991 2959.0737 2967.5434 2969.9527 2974.6162 2974.9764 2977.9116 2983.4199 2991.7097 2994.8502 2996.4286 3009.5940 3013.3761 3021.4081 3022.3354 3036.8483 3037.3935 3047.8540 3060.9897 3063.5022 3064.6024 3071.1357 3072.0959 3075.7650 3076.8306 3085.8752 3100.0741
redmass: 3.8620 3.7479 3.4982 4.6088 2.5379 2.6101 1.9141 3.2652 2.8062 3.5539 2.5814 3.2451 2.3672 2.2463 2.2484 1.5897 2.3074 1.7925 1.6302 2.0074 3.5749 3.0978 2.6243 3.8754 2.8944 2.6606 3.0376 2.5394 2.0570 2.8292 3.9459 2.8029 1.2266 2.1338 1.4351 1.3709 2.8792 1.6863 2.1280 2.1897 2.4458 1.8766 1.7744 1.7710 1.6901 2.1765 1.5258 2.4166 2.5517 3.4522 1.8796 1.4600 2.1703 2.8876 2.2330 2.0938 2.5213 2.3583 2.5503 1.9004 2.0400 1.8639 2.5491 1.6579 1.4772 1.4695 1.4675 1.3323 1.1849 1.2711 1.2299 1.2436 1.2491 1.1750 1.2088 1.2248 1.0811 1.2364 1.3361 1.4244 1.3760 1.2954 1.3894 1.4204 1.4346 1.5049 1.5215 1.2155 1.2128 1.1027 1.0760 1.0862 1.0784 1.0808 1.0857 1.0825 1.0670 1.0443 1.0513 1.0905 1.0496 1.0892 1.0871 8.3930 1.0687 1.0583 1.0849 1.0595 1.0365 1.0598 1.0634 1.0359 1.0599 1.0607 1.0669 1.0936 1.0614 1.0889 1.0634 1.0954 1.0947 1.1021 1.1003 1.1021 1.0968 1.1000 1.0994 1.1003 1.0998 1.1004 1.1050 1.1076
irintensity: 0.0523 1.9446 1.1322 1.7016 1.1573 0.4676 0.0445 1.4520 0.1855 0.7751 0.4863 0.8214 1.4986 1.2148 0.6789 0.9286 2.7305 2.2102 1.4363 1.3045 0.4824 15.4013 2.4050 8.1033 0.0131 6.3895 2.1348 0.5950 1.6579 0.9047 5.0870 4.9135 10.8019 5.1458 7.3115 2.9345 5.6823 2.5502 7.4298 18.3943 10.3233 6.4007 8.6231 4.0738 4.6786 8.7269 19.9173 2.3962 19.4757 52.8919 5.5764 2.3494 18.5158 14.2298 11.7825 13.0835 14.1879 151.0934 53.2608 4.3969 29.2419 6.1746 50.9402 1.9477 7.6256 2.7938 2.5455 7.7695 17.4204 2.8474 6.1826 4.2891 5.9883 6.5021 0.9316 2.0562 0.6272 2.8795 0.4099 4.0351 2.8549 1.1866 12.8392 13.7217 7.7226 6.5606 5.3667 6.2876 13.5004 13.8828 0.4326 7.8193 7.5359 3.6390 3.7013 9.0774 4.0199 14.5604 11.4791 12.1194 12.3272 17.7979 6.6458 114.3744 98.8996 7.9839 16.1388 19.8082 38.4780 76.5719 14.2565 37.6212 50.6872 25.0788 31.9745 1.4735 27.4249 8.6779 40.0971 5.5916 2.1583 5.1168 34.4059 71.0490 46.7486 99.7963 43.4818 21.6292 60.2508 56.9557 74.8900 20.2578
temp: 298.150 k
press: 1.00000 atm
elementType: 8 8 8 6 6 6 6 6 6 6 6 6 6 6 6 6 6 6 1 1 1 1 1 1 1 1 1 1 1 1 1 1 1 1 1 1 1 1 1 1 1 1 1 1 1 1
symmnumber: 1
zpe: 1067861.0 jmol-1
zpe.correction: 0.406727 hartree
zpe.thermalcorrener: 0.428361 hartree
zpe.thermalcorrenthalpy: 0.429305 hartree
zpe.thermalcorrgfe: 0.352569 hartree
zpe.sumelectzpe: -812.591405 hartree
zpe.sumelectthermal: -812.569771 hartree
zpe.sumelectthermalent: -812.568827 hartree
zpe.sumelectthermalfe: -812.645563 hartree
dipole: 0.0198 1.0998 0.3002
dipole: 1.1402
quadrupole: -112.0418 -104.8398 -119.7368
quadrupole: -1.9374 -11.7293 -2.8201
quadrupole: 0.1643 7.3663 -7.5307 -1.9374 -11.7293 -2.8201
hfenergy: -812.9981318 hartree
pointgroup: C01 [X(C15H28O3)]
dipole: -0.0205543 0.435127 -0.1070922 debye
polarizability: 192.1593713|3.9736936|174.9210341|-0.4846342|1.1132153|140.8015208 unknown
InChI: InChI=1S/C15H28O3/c1-3-5-8-13(4-2)15(16)18-12-7-10-14-9-6-11-17-14/h13-14H,3-12H2,1-2H3
charge 0 multiplicity 1
46 atoms
O  3.893268 -0.884942 1.007188
O  -1.402492 -1.540599 0.549745
O  -2.159103 -0.868462 -1.553008
C  3.004136 -1.319799 -0.116848
C  2.970363 -0.132639 -1.117684
C  1.636116 -1.726472 0.455161
C  4.270181 0.650579 -0.80168
C  4.370055 0.489129 0.72766
C  0.684452 -2.28269 -0.627569
C  -2.800462 0.431198 0.452761
C  -2.253846 1.807969 -0.021205
C  -0.689839 -2.696265 -0.082757
C  -0.759322 2.039623 0.294827
C  -4.338119 0.335709 0.234298
C  -2.108313 -0.693009 -0.311636
C  -0.267302 3.43951 -0.13712
C  -4.965571 -0.967202 0.772985
C  1.22254 3.683124 0.188111
H  3.495455 -2.202694 -0.57778
H  2.917716 -0.467298 -2.167382
H  2.08608 0.502245 -0.915376
H  1.177747 -0.848706 0.948596
H  1.796081 -2.48857 1.242801
H  4.222244 1.707558 -1.117435
H  5.1374 0.175008 -1.294899
H  3.722525 1.227428 1.247385
H  5.397436 0.567282 1.12191
H  0.535504 -1.545087 -1.437969
H  1.136983 -3.181777 -1.096392
H  -2.574414 0.296266 1.527322
H  -2.856514 2.599853 0.46814
H  -2.424964 1.89972 -1.11236
H  -0.602597 -3.423493 0.741597
H  -1.328425 -3.098857 -0.889304
H  -0.584331 1.907968 1.382883
H  -0.146609 1.26728 -0.215048
H  -4.545174 0.433791 -0.848979
H  -4.804496 1.207429 0.734178
H  -0.884965 4.212668 0.364252
H  -0.43631 3.564837 -1.225912
H  -6.061745 -0.962601 0.632476
H  -4.760761 -1.094071 1.85242
H  -4.566282 -1.854162 0.247488
H  1.867406 2.947868 -0.330776
H  1.412017 3.587668 1.274126
H  1.545451 4.693185 -0.124391
