program: Gaussian 09
title: 000227197
version: EM64L-G09RevD.01
frameworkgroup: C1[X(C15H12O3)]
method: RPBEPBE
basis: SDD
operation: Freq
keyword: #pfreq=noraman
keyword: PBEPBE/SDD
title: #p freq=noraman PBEPBE/SDD
converged: YES YES NO NO
title: Mulliken charges:
elementType: O O O C C C C C C C C C C C C C C C H H H H H H H H H H H H
charge: -0.225820 -0.244710 -0.244710 -0.524391 -0.524390 0.338222 0.338220 -0.191240 -0.438850 -0.438851 0.342330 0.342333 -0.386434 -0.386434 -0.261281 -0.261281 -0.165491 -0.165492 0.242160 0.242139 0.242160 0.242140 0.281187 0.281187 0.264100 0.264100 0.257050 0.257051 0.262497 0.262498
chargesum: 0.00000
title: Mulliken charges with hydrogens summed into heavy atoms:
elementType: O O O C C C C C C C C C C C C C C C
charge: -0.225820 -0.244710 -0.244710 -0.040092 -0.040090 0.338222 0.338220 -0.191240 -0.157663 -0.157664 0.342330 0.342333 -0.122334 -0.122333 -0.004231 -0.004231 0.097006 0.097005
polarizability: 4.79232725e+02 4.13992292e-05 1.67164024e+02 7.90900525e-02 -1.18918901e-03 7.36811551e+01
1716.lowfreq: -4.3134 -0.0009 -0.0007 -0.0004 2.1071 3.0603 26.0667 31.6397 54.0573
frequency: 26.0152 31.6072 54.0573 79.4971 85.6425 98.6550 113.6810 128.2313 187.2847 244.5232 268.3592 278.0703 301.1716 344.5973 441.4185 470.2086 577.8849 585.4602 585.7141 608.1582 648.6968 659.9273 662.2764 702.4065 727.2656 732.7639 732.9483 753.6662 766.7412 808.4347 809.8308 821.1953 867.8930 867.9839 870.5163 875.3030 882.9082 883.5362 924.1354 944.6165 963.2458 994.0076 996.2519 1017.0010 1017.6736 1050.9046 1053.6569 1087.5956 1131.7156 1132.2615 1151.4078 1180.6342 1203.0119 1206.1248 1235.2484 1260.7779 1268.1313 1270.1674 1292.0583 1338.2471 1339.1866 1373.0216 1373.9627 1443.2213 1459.0330 1467.8156 1468.1150 1540.3102 1543.6113 1550.2619 1643.5965 1665.7692 2998.2748 3009.6284 3038.5200 3059.5479 3102.1681 3103.2198 3219.2332 3219.2552 3234.2068 3234.2212 3265.5481 3265.5529
redmass: 2.7523 4.9438 5.8614 4.7925 2.5986 3.9823 5.0678 5.7064 7.4639 9.2659 4.8785 5.5448 5.5837 4.8714 3.0950 2.8295 7.0033 2.9384 2.9378 8.8096 3.0993 4.1306 5.2601 3.1591 5.6521 1.2736 1.2726 4.7554 5.6170 1.3280 1.3168 1.6256 5.7521 5.7580 5.1578 4.6978 1.3488 1.3610 1.4400 1.5090 3.2420 2.5825 1.8850 1.8568 1.7759 2.1124 2.2642 3.9438 1.5568 1.5610 1.1493 2.0359 1.6021 1.0954 2.3616 1.7610 2.9641 2.3358 1.7240 1.9291 2.1674 2.4484 2.4346 1.0787 1.1655 3.8361 5.0150 6.2940 6.3802 11.5564 8.6723 9.5567 1.0601 1.0629 1.1016 1.1007 1.0885 1.0886 1.0922 1.0922 1.0981 1.0981 1.1083 1.1083
irintensity: 0.0000 1.3903 0.9116 3.7547 0.0000 0.0000 1.1240 0.9019 0.0296 5.9518 4.0868 0.5635 0.0000 0.5859 13.7843 0.0001 37.8800 16.3850 0.0000 10.6151 15.7048 0.0000 18.7024 3.4433 1.2663 0.0052 171.0179 12.0437 2.0550 31.0594 0.0001 24.6181 8.2693 1.4272 25.8907 7.7817 0.0000 0.8044 0.0000 39.9239 45.1749 0.7913 0.0015 2.1222 20.5865 128.6288 0.2807 0.4468 0.0416 4.8073 0.3701 207.3503 11.3313 0.0109 288.9341 1.9065 41.0941 7.9442 69.6389 5.1908 24.1647 8.4771 16.7956 9.9908 20.5017 19.7311 2.0268 109.5130 15.8117 157.7610 468.3402 3.8201 13.9879 12.6347 0.0005 23.2490 0.5348 0.0412 10.5396 1.7379 3.0101 0.0709 0.0513 0.0657
temp: 298.150 k
press: 1.00000 atm
elementType: 8 8 8 6 6 6 6 6 6 6 6 6 6 6 6 6 6 6 1 1 1 1 1 1 1 1 1 1 1 1
symmnumber: 1
zpe: 597658.4 jmol-1
zpe.correction: 0.227636 hartree
zpe.thermalcorrener: 0.242867 hartree
zpe.thermalcorrenthalpy: 0.243811 hartree
zpe.thermalcorrgfe: 0.182662 hartree
zpe.sumelectzpe: -803.150543 hartree
zpe.sumelectthermal: -803.135312 hartree
zpe.sumelectthermalent: -803.134368 hartree
zpe.sumelectthermalfe: -803.195517 hartree
dipole: 0.0000 -3.3668 0.0001
dipole: 3.3668
quadrupole: -62.1223 -102.7001 -108.7040
quadrupole: 0.0000 0.0144 0.0003
quadrupole: 29.0532 -11.5247 -17.5286 0.0000 0.0144 0.0003
hfenergy: -803.3781791 hartree
pointgroup: C01 [X(C15H12O3)]
dipole: -0.0000023 1.3246155 -0.000021 debye
polarizability: 479.2327253|-0.0006047|167.1640238|-0.0790901|-0.001189|73.6811551 unknown
InChI: InChI=1S/C15H12O3/c16-15-11(9-13-3-1-7-17-13)5-6-12(15)10-14-4-2-8-18-14/h1-4,7-10H,5-6H2
charge 0 multiplicity 1
30 atoms
O  0.0000 -2.524812 0.000098
O  3.784697 1.178455 0.000812
O  -3.784678 1.178468 -0.000886
C  0.783081 1.089061 0.000972
C  -0.783082 1.089062 -0.001016
C  1.202917 -0.368591 -0.000113
C  -1.202916 -0.368589 0.000163
C  0.000001 -1.249929 0.000082
C  2.463354 -0.917195 -0.000684
C  -2.463354 -0.917189 0.000749
C  3.731353 -0.246079 -0.000668
C  -3.731346 -0.246066 0.00068
C  5.044048 -0.735738 -0.001699
C  -5.044043 -0.735719 0.001892
C  5.935767 0.393602 -0.001709
C  -5.935755 0.393626 0.001273
C  5.141455 1.53223 0.001082
C  -5.141434 1.53225 -0.000932
H  1.190239 1.61625 0.882899
H  1.192574 1.618778 -0.878337
H  -1.190234 1.616186 -0.882985
H  -1.192579 1.618842 0.878253
H  2.513368 -2.015643 -0.001214
H  -2.513373 -2.015638 0.001389
H  5.321484 -1.788347 -0.003013
H  -5.321484 -1.788327 0.003343
H  7.023571 0.370403 -0.002799
H  -7.023559 0.370434 0.002027
H  5.350705 2.598547 0.002523
H  -5.350677 2.598568 -0.002284
