program: Gaussian 09
title: 000227196
version: EM64L-G09RevD.01
frameworkgroup: C1[X(C14H26O3)]
method: RPBEPBE
basis: SDD
operation: Freq
keyword: #pfreq=noraman
keyword: PBEPBE/SDD
title: #p freq=noraman PBEPBE/SDD
converged: YES YES NO NO
title: Mulliken charges:
elementType: O O O C C C C C C C C C C C C C C H H H H H H H H H H H H H H H H H H H H H H H H H H
charge: -0.279061 -0.264853 -0.247668 -0.005782 -0.482168 -0.419871 -0.454137 -0.368397 -0.296712 -0.393292 -0.288503 -0.132854 -0.389508 -0.389661 0.220495 -0.699545 -0.699615 0.204981 0.231508 0.216618 0.209112 0.199327 0.224914 0.224884 0.184417 0.234263 0.189627 0.220780 0.205126 0.214019 0.225745 0.225986 0.223508 0.221504 0.201417 0.201874 0.221478 0.211026 0.215577 0.228882 0.215387 0.227708 0.211464
chargesum: 0.00000
title: Mulliken charges with hydrogens summed into heavy atoms:
elementType: O O O C C C C C C C C C C C C C C
charge: -0.279061 -0.264853 -0.247668 0.199199 -0.034042 -0.011431 -0.004340 0.050283 0.113695 0.025852 0.163228 0.090654 0.033414 0.033691 0.220495 -0.044060 -0.045055
polarizability: 2.00394572e+02 2.65404500e+00 1.48200399e+02 -9.50902770e-01 1.02084366e+00 1.33774041e+02
1716.lowfreq: -0.0004 0.0005 0.0009 2.7703 4.0637 10.1803 16.1202 24.9340 29.6785
frequency: 15.7147 24.4920 29.2797 41.8830 50.2649 62.7036 81.5469 85.5961 100.6463 114.1859 130.2475 144.5971 151.5176 191.8950 205.1600 217.2761 227.4880 254.8770 259.4587 302.8526 359.8662 370.9679 411.4546 415.2187 466.2023 501.1358 568.3091 630.6075 640.1392 704.3979 724.9879 755.0121 776.8148 788.6067 802.5793 851.6005 856.8902 870.9152 879.6281 903.9938 918.1769 924.2518 925.2627 935.8333 1005.6519 1018.0940 1018.1166 1033.3995 1046.3489 1047.8621 1061.2608 1074.9770 1090.9951 1099.4967 1103.4458 1112.4338 1119.2769 1139.2094 1148.2114 1154.7059 1166.4348 1169.2257 1217.8685 1236.4625 1242.4998 1245.2379 1257.3299 1273.3657 1274.8492 1278.1971 1290.6023 1301.7202 1310.3380 1314.7413 1326.6216 1330.8514 1338.1769 1345.2987 1356.6999 1366.0246 1377.5063 1394.3082 1394.6668 1444.6766 1459.5977 1463.3594 1466.5784 1467.9153 1470.2523 1473.6311 1477.7373 1478.2738 1483.0648 1484.2631 1486.9663 1489.7765 1630.8056 2955.7584 2960.0141 2960.3041 2965.8444 2977.0736 2977.8664 2980.8608 2985.6752 2986.3419 2997.5070 3000.9445 3011.6900 3014.3619 3015.6347 3030.4787 3034.2226 3045.4757 3050.3169 3061.7440 3072.0849 3074.7020 3075.2845 3075.7905 3076.1816 3077.8337 3087.3480
redmass: 3.6157 3.0494 4.9912 3.8565 4.0959 2.9323 2.4432 2.1645 2.5116 2.9226 2.3836 3.1174 1.9169 2.0815 2.4143 2.5811 1.7743 1.4270 1.8940 2.8840 3.5716 3.4978 3.5898 2.7314 2.4997 3.7755 1.9885 2.7659 3.2204 3.7611 1.3834 1.5736 1.3009 2.3583 1.5038 1.6007 2.0543 3.3151 1.4168 2.0500 1.5408 2.5131 2.1694 3.0409 2.3230 1.7148 2.4959 2.9259 2.1618 1.4893 3.1071 2.3653 2.4032 2.4696 2.1157 2.0412 2.3652 1.7820 1.5011 2.4609 1.3579 1.4699 1.3399 1.2676 1.2845 1.2763 1.2835 1.2774 1.1660 1.1162 1.1285 1.2902 1.1947 1.3112 1.4440 1.3593 1.3124 1.3261 1.4991 1.6932 1.6226 1.2107 1.2154 1.0858 1.0767 1.0888 1.0750 1.0773 1.0987 1.0880 1.0487 1.0503 1.0524 1.0487 1.0941 1.0919 9.0491 1.0696 1.0811 1.0608 1.0658 1.0361 1.0355 1.0598 1.0602 1.0602 1.0631 1.0571 1.0623 1.0863 1.0938 1.1014 1.1015 1.0990 1.1038 1.0969 1.1004 1.1064 1.1014 1.1001 1.0991 1.1007 1.1056
irintensity: 0.2918 0.1538 0.3936 1.7494 2.9446 1.9602 0.3224 0.2570 0.9033 1.2464 0.8617 1.0195 0.0462 0.6364 3.1683 5.2198 1.3762 1.1839 3.0949 4.5644 9.7178 6.5964 0.3442 1.6462 1.4843 1.9334 1.3399 0.9876 0.9538 4.0441 3.2619 11.9191 1.0160 18.8222 4.9304 7.0751 15.6772 3.1580 3.6132 12.5869 6.8530 6.8533 2.0255 51.2254 63.5157 1.8454 5.3218 1.2342 47.2514 11.0885 6.9841 32.3900 53.8112 3.6255 145.3939 3.3045 133.7473 1.2903 1.3284 65.8730 1.5242 7.1500 1.8784 6.7913 1.4909 0.3468 25.9976 1.6651 0.0717 0.9501 2.5606 7.1590 0.7468 1.0775 2.1811 7.6646 9.6886 19.6621 17.5571 3.2788 3.5014 13.6130 10.2319 2.7167 1.1384 9.2651 2.3207 15.3792 11.0700 1.9029 3.0677 21.2591 11.6665 15.0111 17.1268 2.0565 145.4164 103.5008 1.3508 11.9717 38.7595 46.0079 15.9412 0.4154 63.3560 21.6880 32.9464 30.6849 29.0344 7.6864 23.1156 5.6660 0.0558 10.1034 22.0090 44.9855 16.8033 96.8740 7.3927 16.4125 64.4737 116.6206 66.8030
temp: 298.150 k
press: 1.00000 atm
elementType: 8 8 8 6 6 6 6 6 6 6 6 6 6 6 6 6 6 1 1 1 1 1 1 1 1 1 1 1 1 1 1 1 1 1 1 1 1 1 1 1 1 1 1
symmnumber: 1
zpe: 993410.6 jmol-1
zpe.correction: 0.378370 hartree
zpe.thermalcorrener: 0.398918 hartree
zpe.thermalcorrenthalpy: 0.399863 hartree
zpe.thermalcorrgfe: 0.325136 hartree
zpe.sumelectzpe: -773.368279 hartree
zpe.sumelectthermal: -773.347730 hartree
zpe.sumelectthermalent: -773.346786 hartree
zpe.sumelectthermalfe: -773.421513 hartree
dipole: 2.4262 -1.3461 -2.7424
dipole: 3.9012
quadrupole: -86.0486 -103.4660 -111.4961
quadrupole: -3.0321 2.8762 -2.7188
quadrupole: 14.2883 -3.1291 -11.1592 -3.0321 2.8762 -2.7188
hfenergy: -773.7466487 hartree
pointgroup: C01 [X(C14H26O3)]
dipole: 0.9568851 0.4954669 1.0930201 debye
polarizability: 200.4108363|-2.5645806|148.1048803|0.6508367|1.5087152|133.8532947 unknown
InChI: InChI=1S/C14H26O3/c1-3-12(4-2)14(15)17-10-6-5-8-13-9-7-11-16-13/h12-13H,3-11H2,1-2H3
charge 0 multiplicity 1
43 atoms
O  4.606109 -0.83624 -0.651497
O  -1.929847 0.068304 0.221084
O  -3.190213 -0.173761 -1.722828
C  4.386351 0.570944 -0.17996
C  5.605212 0.912139 0.714446
C  3.024906 0.665068 0.526102
C  6.713007 -0.040882 0.199059
C  1.837769 0.345229 -0.407493
C  5.906266 -1.314011 -0.125197
C  0.483328 0.355336 0.337808
C  -0.685185 0.082937 -0.608896
C  -4.332251 -0.086058 0.470591
C  -5.10224 -1.428979 0.317366
C  -5.255901 1.127377 0.161018
C  -3.134764 -0.072613 -0.473543
C  -4.268065 -2.671721 0.694122
C  -4.582611 2.49741 0.388664
H  4.381426 1.204865 -1.09196
H  5.887872 1.97623 0.643744
H  5.370569 0.687352 1.772778
H  3.027726 -0.038056 1.383319
H  2.910009 1.687566 0.943814
H  7.509417 -0.217693 0.942617
H  7.17398 0.365738 -0.719476
H  1.814744 1.083436 -1.236586
H  2.012719 -0.645204 -0.869845
H  5.740438 -1.922925 0.788601
H  6.364851 -1.948088 -0.903146
H  0.327466 1.333353 0.833912
H  0.489337 -0.412351 1.13549
H  -0.789321 0.861986 -1.386813
H  -0.592931 -0.896073 -1.115158
H  -3.947624 0.001175 1.504314
H  -5.4515 -1.514104 -0.729904
H  -6.004916 -1.377033 0.957578
H  -6.153611 1.041611 0.804551
H  -5.600198 1.045955 -0.888275
H  -3.898374 -2.606732 1.734498
H  -4.871821 -3.593052 0.604123
H  -3.391069 -2.781855 0.030113
H  -5.292732 3.321876 0.195065
H  -3.717237 2.636915 -0.285098
H  -4.219391 2.596925 1.428599
