program: Gaussian 09
title: 000227194
version: EM64L-G09RevD.01
frameworkgroup: C1[X(C13H28O5)]
method: RPBEPBE
basis: SDD
operation: Freq
keyword: #pfreq=noraman
keyword: PBEPBE/SDD
title: #p freq=noraman PBEPBE/SDD
converged: YES YES NO NO
title: Mulliken charges:
elementType: O O O O O C C C C C C C C C C C C C H H H H H H H H H H H H H H H H H H H H H H H H H H H H
charge: -0.463784 -0.446647 -0.459559 -0.468750 -0.437070 -0.049846 -0.405552 -0.436457 -0.436730 -0.433895 -0.061187 -0.038138 -0.429160 -0.401869 -0.370003 -0.406636 -0.338701 -0.325407 0.182128 0.208386 0.227186 0.202121 0.214334 0.185064 0.241973 0.212512 0.198251 0.205119 0.180184 0.230438 0.195261 0.213890 0.191960 0.240832 0.191443 0.262274 0.172035 0.338671 0.323373 0.342064 0.198962 0.183273 0.219288 0.175190 0.345522 0.327658
chargesum: 0.00000
title: Mulliken charges with hydrogens summed into heavy atoms:
elementType: O O O O O C C C C C C C C C C C C C
charge: -0.125113 -0.123275 -0.117494 -0.123228 -0.109412 0.132282 0.030020 -0.020001 -0.009693 -0.023132 0.143932 0.142046 -0.003461 0.003980 0.062271 0.027673 0.043533 0.069071
polarizability: 2.11856265e+02 1.13727317e+00 1.38161705e+02 -1.28775344e+00 -8.75908113e-02 1.35606153e+02
1716.lowfreq: -30.2278 -13.3528 -4.5665 -3.7871 -0.0007 -0.0003 0.0006 10.3990 22.6268
frequency: -23.8344 9.9027 21.7388 31.9201 40.9006 51.2898 56.4937 65.4459 77.0652 100.6641 108.3037 129.1330 132.8419 138.1339 143.8016 169.4033 192.2692 243.3907 251.5887 268.8786 282.2618 288.8140 294.5449 304.4731 309.8303 316.7246 340.7523 411.6901 420.7718 425.1514 449.1558 465.6382 485.2324 520.8218 538.7150 587.2178 749.2870 753.5737 759.5841 781.1129 814.3991 825.7883 841.2572 881.6398 882.5169 906.1746 949.4710 963.0958 978.3612 1006.4377 1010.9662 1017.1314 1030.2895 1037.1680 1047.2801 1053.3312 1065.2254 1076.8194 1081.2066 1089.2560 1097.1446 1105.5955 1108.9681 1125.5087 1131.4535 1143.0123 1187.4406 1194.9690 1215.9868 1227.8191 1228.7135 1239.4725 1244.8676 1253.6631 1270.4117 1277.1651 1279.8091 1285.3283 1286.8726 1294.0947 1304.7232 1319.4412 1323.5547 1334.7566 1342.9488 1344.8403 1353.9931 1359.0877 1365.5235 1372.1561 1380.4986 1385.3824 1388.7928 1400.9814 1437.0767 1442.3735 1447.8783 1450.7616 1455.9824 1460.6481 1466.0527 1469.4467 1476.5759 1482.7053 2907.5399 2909.4615 2930.6268 2934.7949 2953.1768 2953.3510 2954.0893 2959.1058 2968.0266 2971.5706 2979.2148 2982.5648 2993.1926 3006.5997 3008.0654 3025.3138 3026.8472 3034.2295 3038.3489 3057.4127 3057.8584 3062.8131 3077.3038 3534.5154 3557.0638 3562.6635 3565.4700 3574.8252
redmass: 2.3105 5.4025 4.6598 4.2620 3.7257 4.5630 3.0595 3.5528 3.9609 3.2439 3.3983 3.5008 2.5757 2.3576 3.0575 2.4761 2.9363 2.8169 3.1440 1.4357 1.0996 2.4065 2.8807 1.1035 1.1580 1.2251 3.2912 2.8192 2.7258 2.9932 2.7899 2.5169 2.6332 2.8902 2.4592 2.6057 1.1912 1.3691 1.5250 1.6313 2.2617 2.6398 1.7415 2.3539 1.9331 2.0554 4.1215 2.0418 2.8821 2.3966 2.2361 2.6924 3.8578 1.7295 1.9680 2.2971 2.1445 2.1750 2.5070 1.6987 2.2592 1.4812 2.6035 1.7407 1.2983 1.4017 1.2507 1.1885 1.2247 1.3337 1.3299 1.3138 1.2458 1.2895 1.1666 1.2312 1.1726 1.1669 1.1538 1.2147 1.2616 1.2369 1.2988 1.3049 1.3120 1.2260 1.3515 1.2951 1.4998 1.5734 1.4422 1.5468 1.6910 1.4174 1.0893 1.0848 1.0821 1.0806 1.0944 1.0957 1.0772 1.0892 1.0811 1.0922 1.0832 1.0834 1.0558 1.0701 1.0651 1.0672 1.0602 1.0588 1.0601 1.0597 1.0860 1.0605 1.0834 1.0875 1.0991 1.0941 1.0992 1.0993 1.0983 1.0909 1.1002 1.1005 1.0988 1.0657 1.0661 1.0659 1.0659 1.0665
irintensity: 4.8289 0.5129 0.2835 1.6342 0.6475 1.3927 2.5948 0.4794 1.5088 2.5290 1.5047 3.8026 10.9724 11.5205 3.7440 11.7458 2.6214 31.4704 5.3535 88.1214 290.9618 14.6604 15.8807 139.0166 122.5088 102.3092 22.6470 9.1635 24.5652 16.0454 6.9618 3.9944 8.1930 7.7646 2.8527 15.6223 1.4746 6.3797 1.5505 1.0424 17.4693 7.5700 14.0897 9.1260 2.6655 98.3926 94.1505 21.7137 22.1834 61.4993 23.5564 3.6075 19.3938 6.9232 63.1955 46.1908 13.5058 6.2270 11.6969 3.8066 10.3314 6.2812 13.9528 19.8449 2.4760 7.4898 2.6090 23.6325 28.1578 25.5370 50.1860 21.0812 0.7973 38.2306 5.0478 11.3678 4.7295 3.6452 1.7604 0.6232 3.6290 10.9270 5.1767 10.4254 0.8095 16.5465 12.7422 10.8267 17.0346 3.7750 5.6088 66.1607 0.7446 4.3275 0.4855 2.1303 2.7110 1.5818 11.5285 4.8592 2.0074 27.8716 3.3978 8.2523 52.5250 37.3503 81.7262 75.9279 12.5588 27.8191 11.7861 32.7209 21.2086 56.6366 22.3829 30.6457 88.2337 16.3213 1.6302 17.3508 3.2015 64.8637 21.6631 8.5339 20.4859 99.1326 59.7766 3.6828 6.9285 3.3480 2.9584 2.8943
temp: 298.150 k
press: 1.00000 atm
elementType: 8 8 8 8 8 6 6 6 6 6 6 6 6 6 6 6 6 6 1 1 1 1 1 1 1 1 1 1 1 1 1 1 1 1 1 1 1 1 1 1 1 1 1 1 1 1
symmnumber: 1
zpe: 1050481.9 jmol-1
zpe.correction: 0.400107 hartree
zpe.thermalcorrener: 0.423293 hartree
zpe.thermalcorrenthalpy: 0.424237 hartree
zpe.thermalcorrgfe: 0.343833 hartree
zpe.sumelectzpe: -886.736189 hartree
zpe.sumelectthermal: -886.713004 hartree
zpe.sumelectthermalent: -886.712060 hartree
zpe.sumelectthermalfe: -886.792464 hartree
dipole: 4.0576 1.6437 2.8020
dipole: 5.1978
quadrupole: -127.8872 -113.3285 -109.8099
quadrupole: 9.6374 -15.5333 0.2606
quadrupole: -10.8787 3.6801 7.1986 9.6374 -15.5333 0.2606
hfenergy: -887.1362965 hartree
pointgroup: C01 [X(C13H28O5)]
dipole: -1.5990979 0.8103384 -0.9839522 debye
polarizability: 211.8372794|-1.0863101|138.0805781|-1.7886557|0.4759044|135.7062654 unknown
InChI: InChI=1S/C13H28O5/c14-9-1-3-11(16)5-7-13(18)8-6-12(17)4-2-10-15/h11-18H,1-10H2
charge 0 multiplicity 1
46 atoms
O  -0.130015 1.538063 1.139144
O  -3.884944 -1.592575 -0.718928
O  3.999905 -1.245523 1.09318
O  -7.719529 0.509473 -1.406664
O  8.823229 -0.218665 -0.792991
C  -0.073814 0.471759 0.112789
C  -1.333984 -0.378363 0.319727
C  1.226734 -0.356469 0.230482
C  -2.640315 0.408492 0.094455
C  2.512897 0.486382 0.072907
C  -3.898764 -0.469208 0.254911
C  3.795027 -0.365172 -0.076426
C  -5.205432 0.341503 0.134355
C  5.064431 0.494882 -0.175751
C  -6.4710 -0.50005 0.401165
C  6.335385 -0.328013 -0.480421
C  -7.763042 0.241563 0.045897
C  7.597708 0.550868 -0.520183
H  -0.103332 0.937217 -0.901496
H  -1.31594 -0.775139 1.354643
H  -1.310335 -1.248439 -0.36431
H  1.203086 -1.142888 -0.553333
H  1.222725 -0.862243 1.217326
H  -2.642801 0.854894 -0.923919
H  -2.680388 1.250366 0.810682
H  2.642246 1.148718 0.953023
H  2.421556 1.131484 -0.826866
H  -3.864447 -0.992699 1.230076
H  3.697357 -0.989232 -0.996696
H  -5.274485 0.779685 -0.882236
H  -5.163161 1.192605 0.844678
H  5.189576 1.029266 0.787215
H  4.911681 1.265009 -0.959601
H  -6.421929 -1.434174 -0.188543
H  -6.51372 -0.791958 1.470069
H  6.455373 -1.112648 0.287135
H  6.215011 -0.841846 -1.459447
H  0.640928 2.147548 1.015341
H  -4.059958 -1.211015 -1.618413
H  3.226352 -1.858321 1.176824
H  -8.642799 -0.38786 0.298797
H  -7.832497 1.195455 0.614484
H  7.781249 1.010057 0.466334
H  7.474723 1.36816 -1.266135
H  -8.556151 0.95871 -1.685061
H  8.704804 -0.709558 -1.645416
