program: Gaussian 09
title: 000227193
version: EM64L-G09RevD.01
frameworkgroup: C1[X(C13H26O4)]
method: RPBEPBE
basis: SDD
operation: Freq
keyword: #pfreq=noraman
keyword: PBEPBE/SDD
title: #p freq=noraman PBEPBE/SDD
converged: YES YES NO NO
title: Mulliken charges:
elementType: O O O O C C C C C C C C C C C C C H H H H H H H H H H H H H H H H H H H H H H H H H H
charge: -0.283859 -0.468558 -0.463313 -0.450778 -0.010719 -0.410589 -0.481269 -0.402820 -0.051721 -0.458301 -0.432252 -0.294230 -0.430444 -0.035499 -0.423823 -0.377848 -0.333274 0.204598 0.238539 0.192212 0.231594 0.216294 0.197204 0.241667 0.175740 0.223081 0.223165 0.228580 0.201255 0.187808 0.216400 0.231480 0.202529 0.180063 0.178006 0.212814 0.232013 0.212570 0.331416 0.331927 0.184491 0.191092 0.342759
chargesum: 0.00000
title: Mulliken charges with hydrogens summed into heavy atoms:
elementType: O O O O C C C C C C C C C C C C C
charge: -0.283859 -0.137142 -0.131385 -0.108020 0.193878 0.020161 -0.033382 0.036050 0.124019 -0.012054 -0.002416 0.109978 0.003566 0.144564 -0.033003 0.066735 0.042309
polarizability: 1.73258443e+02 -1.90485250e+00 1.65972503e+02 1.87083229e+00 1.49935288e+00 1.22154153e+02
1716.lowfreq: -9.3718 -4.0117 -0.0005 -0.0003 0.0001 7.0094 10.9416 20.5401 26.6967
frequency: 7.4168 20.3603 26.5986 39.2873 54.2938 57.8401 66.8163 95.5977 97.6108 121.1139 124.2702 152.8887 162.6993 192.2234 208.9523 237.2253 250.0355 267.0472 295.0185 306.2785 320.0582 349.2929 386.8371 422.3909 437.0760 469.6638 487.3984 507.9902 540.7061 572.7392 636.7162 731.8344 760.7286 771.5768 787.5188 844.6599 853.7068 859.2048 880.9768 898.4326 910.0591 924.3036 949.7565 973.2366 983.6733 997.1190 1011.3749 1015.9632 1032.0777 1047.2354 1054.6198 1055.9809 1066.1097 1075.4156 1084.0815 1093.1662 1110.3880 1128.0842 1142.5443 1156.3164 1167.4011 1171.7163 1173.8423 1209.4676 1218.2021 1236.8478 1240.3155 1250.9735 1259.6551 1269.2575 1272.4206 1280.7756 1288.0366 1291.0496 1300.6886 1304.3298 1311.4977 1320.7216 1329.3111 1330.3285 1340.3361 1353.1304 1363.2345 1368.1225 1395.2745 1397.0495 1415.1549 1441.4350 1447.1834 1456.2152 1461.2882 1462.1632 1468.7134 1469.3720 1471.7587 1486.8884 1490.4054 2912.0954 2922.9396 2924.9882 2947.0671 2951.5311 2956.0759 2970.6959 2972.6636 2972.9863 2981.3832 2982.6512 2995.2311 2996.5698 3008.4442 3015.3634 3026.5392 3035.0791 3054.0529 3058.6899 3061.6654 3065.6650 3071.4688 3085.0690 3557.6384 3559.3488 3566.7195
redmass: 3.3573 4.9218 3.5564 3.6297 2.7740 2.7790 3.3335 3.2747 3.1869 2.6497 3.0908 2.4493 3.5300 3.3695 2.4874 2.7837 2.3364 1.0996 1.1282 1.1843 3.6137 3.5609 3.3566 2.8337 2.4501 2.7201 3.0077 3.0661 2.6483 2.1159 3.5384 1.9930 1.4364 1.1273 2.1791 1.5880 2.0112 2.4402 1.5775 1.7662 2.4448 2.5009 1.9688 4.5408 2.4800 2.3419 2.4077 3.0946 2.4507 3.0706 2.6445 2.4885 1.8377 1.9204 1.9768 1.6266 1.7630 1.8649 1.3824 1.5763 1.2367 1.3431 1.6349 1.2451 1.3332 1.2721 1.2587 1.2776 1.2711 1.2345 1.2269 1.2723 1.1632 1.1118 1.1497 1.1709 1.3326 1.2158 1.2479 1.3312 1.3025 1.4806 1.5722 1.5905 1.6432 1.6851 1.4446 1.0820 1.0841 1.0967 1.0881 1.0848 1.0988 1.1008 1.0827 1.0895 1.0916 1.0831 1.0832 1.0549 1.0630 1.0803 1.0710 1.0605 1.0629 1.1054 1.0621 1.0614 1.0621 1.0626 1.0624 1.0950 1.0993 1.0966 1.0968 1.1015 1.1016 1.1029 1.1004 1.1054 1.0659 1.0660 1.0665
irintensity: 0.1186 0.6392 2.6817 2.6411 6.9343 5.8889 1.2232 2.6484 0.4988 0.5671 3.7863 3.0292 3.1208 3.8274 2.0012 2.0670 0.7323 149.1737 96.0031 154.6209 52.6075 2.8320 11.4153 11.4023 7.4923 0.9201 20.6546 20.9555 2.3822 2.9316 2.9404 9.9896 0.6715 8.0970 0.9266 8.8928 2.4355 50.9263 3.4669 16.7926 16.9220 20.0296 14.6855 39.3282 82.9904 53.9197 81.6649 3.2784 7.0495 29.1534 8.5932 12.8189 15.1934 30.9079 1.4664 2.2697 0.5510 3.7609 2.2277 0.6906 1.2134 11.3542 16.6928 14.9344 1.8801 69.0081 36.6305 0.9979 11.6707 3.4894 20.1360 2.1793 1.8199 4.1547 0.5630 3.2810 1.3016 5.0553 24.8968 9.8084 0.2485 7.2977 7.4763 0.9543 19.8636 19.9955 6.3672 0.6537 2.7919 5.2431 15.7864 2.4895 14.9631 7.0388 3.8569 7.9104 1.0509 46.4246 37.3635 64.2912 59.3339 74.6186 36.6394 13.5097 2.7720 52.5983 18.3930 76.0280 24.9472 40.6223 29.2724 30.0132 4.5918 1.0672 49.1037 77.9893 29.7498 60.3179 27.4881 70.9480 5.2610 4.7791 2.3316
temp: 298.150 k
press: 1.00000 atm
elementType: 8 8 8 8 6 6 6 6 6 6 6 6 6 6 6 6 6 1 1 1 1 1 1 1 1 1 1 1 1 1 1 1 1 1 1 1 1 1 1 1 1 1 1
symmnumber: 1
zpe: 988604.5 jmol-1
zpe.correction: 0.376540 hartree
zpe.thermalcorrener: 0.397478 hartree
zpe.thermalcorrenthalpy: 0.398422 hartree
zpe.thermalcorrgfe: 0.322012 hartree
zpe.sumelectzpe: -810.423575 hartree
zpe.sumelectthermal: -810.402636 hartree
zpe.sumelectthermalent: -810.401692 hartree
zpe.sumelectthermalfe: -810.478102 hartree
dipole: 2.1733 0.7143 1.5522
dipole: 2.7645
quadrupole: -72.4226 -105.3806 -106.8694
quadrupole: -1.6485 1.0465 5.4128
quadrupole: 22.4682 -10.4897 -11.9785 -1.6485 1.0465 5.4128
hfenergy: -810.8001141 hartree
pointgroup: C01[X(C13H26O4)]
dipole: -0.8535205 -0.3091955 0.5990713 debye
polarizability: 173.3685149|-1.7033936|165.9258113|-1.4318893|-0.9145282|122.0907739 unknown
InChI: InChI=1S/C13H26O4/c14-9-1-3-11(15)5-6-12(16)7-8-13-4-2-10-17-13/h11-16H,1-10H2
charge 0 multiplicity 1
43 atoms
O  3.015074 -1.526413 -0.039835
O  1.216527 3.351121 -0.30128
O  -3.703771 2.360239 0.560756
O  -4.510335 -3.707677 -0.700256
C  3.642225 -0.217367 -0.429556
C  2.805349 0.939193 0.131019
C  5.097937 -0.282054 0.093289
C  1.363823 0.953694 -0.418008
C  0.523706 2.112906 0.135168
C  5.406065 -1.800142 0.117812
C  -0.940641 2.119265 -0.353905
C  4.053873 -2.389318 0.569748
C  -1.783951 0.956671 0.215441
C  -3.281979 1.099089 -0.096587
C  -4.140893 -0.080742 0.413251
C  -3.889976 -1.404402 -0.344349
C  -4.839496 -2.51851 0.104026
H  3.630611 -0.186042 -1.540101
H  3.295546 1.900524 -0.115553
H  2.783976 0.853219 1.236635
H  5.793798 0.287638 -0.545799
H  5.148698 0.135691 1.117179
H  1.384035 1.041344 -1.5234
H  0.881364 -0.009613 -0.170079
H  0.525214 2.069044 1.250012
H  6.233971 -2.061653 0.799549
H  5.661227 -2.156675 -0.896949
H  -1.425596 3.067676 -0.046886
H  -0.94696 2.091327 -1.462395
H  3.958647 -2.361348 1.675935
H  3.879241 -3.421589 0.219308
H  -1.425313 -0.007583 -0.189248
H  -1.67014 0.915079 1.318292
H  -3.421805 1.194389 -1.198716
H  -5.21352 0.1940 0.304976
H  -3.953498 -0.210948 1.498113
H  -2.852022 -1.752593 -0.191025
H  -4.021983 -1.252076 -1.433795
H  0.668942 4.12933 -0.024722
H  -4.671614 2.495926 0.398255
H  -5.895761 -2.210121 -0.062187
H  -4.702783 -2.721881 1.189083
H  -5.081012 -4.466419 -0.418715
