program: Gaussian 09
title: 000227191
version: EM64L-G09RevD.01
frameworkgroup: C1[X(C13H24O3)]
method: RPBEPBE
basis: SDD
operation: Freq
keyword: #pfreq=noraman
keyword: PBEPBE/SDD
title: #p freq=noraman PBEPBE/SDD
converged: YES YES NO NO
title: Mulliken charges:
elementType: O O O C C C C C C C C C C C C C H H H H H H H H H H H H H H H H H H H H H H H H
charge: -0.279211 -0.262256 -0.249485 -0.003336 -0.480778 -0.412893 -0.454835 -0.295589 -0.382793 -0.287769 -0.131756 -0.390531 -0.389567 0.220103 -0.699604 -0.698753 0.205709 0.232359 0.216480 0.197820 0.207325 0.226037 0.225313 0.191010 0.221138 0.249424 0.201980 0.224091 0.220065 0.224882 0.201876 0.221496 0.220782 0.201272 0.212356 0.215156 0.226958 0.212712 0.214871 0.227942
chargesum: 0.00000
title: Mulliken charges with hydrogens summed into heavy atoms:
elementType: O O O C C C C C C C C C C C C C
charge: -0.279211 -0.262256 -0.249485 0.202373 -0.031939 -0.007748 -0.003485 0.116559 0.068611 0.156386 0.093127 0.032842 0.032487 0.220103 -0.045135 -0.043227
polarizability: 1.83965990e+02 -2.18450522e+00 1.38731102e+02 -5.38934274e-01 -1.41959380e+00 1.26053426e+02
1716.lowfreq: -3.5628 -0.0008 -0.0004 0.0004 6.8457 10.1259 16.7286 25.1081 35.1840
frequency: 15.6842 24.8845 34.8086 47.1023 54.5890 72.6797 79.2332 90.0219 119.1983 132.8335 140.0859 155.5634 194.4511 214.7430 221.5026 235.8966 250.6875 279.1829 316.2732 371.4822 415.2398 424.5557 434.7639 496.7875 569.0147 632.6835 638.0416 704.6682 735.6391 775.4917 777.2437 788.3372 851.3702 851.9921 856.2508 873.5072 895.3266 905.2416 923.3093 925.5875 941.2535 1001.2446 1019.1504 1022.1820 1044.6189 1047.8617 1052.4884 1061.1799 1087.8504 1099.9608 1103.7521 1110.7995 1119.7141 1135.3455 1147.8646 1155.1230 1165.9081 1177.7730 1218.6396 1245.3484 1246.9399 1257.2070 1261.4837 1276.7027 1279.0421 1284.6812 1309.3171 1311.9367 1323.8945 1328.5128 1331.3014 1341.2330 1354.2514 1366.4999 1379.7809 1392.9237 1396.5975 1448.1528 1458.2583 1461.9262 1467.3012 1468.6874 1471.6595 1476.9353 1478.1497 1481.8308 1483.0990 1486.9827 1490.6339 1629.5886 2957.1003 2960.8025 2962.8183 2977.3208 2978.3669 2981.0532 2985.8113 2993.2235 2997.7856 2999.8089 3011.5285 3015.7673 3023.7011 3034.5021 3045.9897 3050.5860 3061.8597 3073.1353 3074.6910 3075.8416 3076.2229 3078.3112 3081.6676 3088.0095
redmass: 3.3435 3.4979 4.4216 3.9645 3.9402 2.1562 2.5229 2.9609 1.8039 3.2994 2.6365 2.3137 1.4535 2.2719 3.5525 1.8310 1.4915 2.3639 3.5783 3.5417 2.7318 3.5731 2.8680 3.0966 2.0188 2.7931 3.1925 3.7550 1.6584 1.3975 1.5319 2.3287 1.4756 1.5006 2.0374 3.4060 1.4593 2.2777 2.5674 2.1669 3.0122 2.1992 1.7091 2.1510 2.8017 1.4878 2.4301 3.1296 2.3035 2.4247 2.1121 1.9990 2.4749 1.8008 1.5277 2.4587 1.4615 1.3184 1.3322 1.2747 1.2545 1.2813 1.2193 1.1640 1.2445 1.1542 1.2179 1.2943 1.2837 1.4402 1.3753 1.2881 1.4317 1.6274 1.6495 1.2133 1.2138 1.0870 1.0768 1.0891 1.0777 1.0982 1.0843 1.0470 1.0508 1.0514 1.0498 1.0920 1.0918 9.0117 1.0774 1.0744 1.0609 1.0363 1.0355 1.0595 1.0602 1.0601 1.0631 1.0623 1.0622 1.0865 1.0966 1.1015 1.0988 1.1040 1.0972 1.1002 1.1003 1.0998 1.0998 1.1005 1.1046 1.1056
irintensity: 0.0438 1.3699 0.1423 5.1866 1.9274 0.2074 0.2192 1.1685 0.0953 0.7403 0.1394 1.2375 1.9255 4.6098 1.9816 0.3941 1.0863 3.3318 13.7369 3.8420 1.7266 5.8423 2.2661 3.5295 1.1052 1.2705 1.0668 4.0563 2.8626 8.1025 3.4583 16.8949 5.5209 4.2666 16.5471 4.0964 5.2639 28.8601 12.3632 2.3121 37.3846 61.8930 1.5333 0.9339 23.6505 10.6864 57.4967 2.8586 25.1915 17.8085 147.1226 2.5351 145.0520 3.5316 1.9208 67.0226 3.6055 3.9749 3.1155 0.5929 3.9616 26.8816 0.4185 0.2432 3.5668 3.9537 3.2759 0.0713 2.9828 2.8456 9.3344 0.5301 52.9349 2.1466 0.8859 12.3815 11.6735 2.1568 0.5716 9.8391 17.6489 11.7366 1.2151 8.9011 15.6516 11.1642 16.6151 13.1734 2.0123 145.2340 90.5033 17.7801 28.9917 43.7979 19.1935 1.5347 63.8958 3.2200 23.7605 40.9878 28.2628 7.5162 37.1620 0.1419 9.9230 3.0419 44.3365 18.9796 25.5867 50.2617 46.1586 104.0069 43.4237 70.3067
temp: 298.150 k
press: 1.00000 atm
elementType: 8 8 8 6 6 6 6 6 6 6 6 6 6 6 6 6 1 1 1 1 1 1 1 1 1 1 1 1 1 1 1 1 1 1 1 1 1 1 1 1
symmnumber: 1
zpe: 920020.6 jmol-1
zpe.correction: 0.350417 hartree
zpe.thermalcorrener: 0.369616 hartree
zpe.thermalcorrenthalpy: 0.370560 hartree
zpe.thermalcorrgfe: 0.299249 hartree
zpe.sumelectzpe: -734.145112 hartree
zpe.sumelectthermal: -734.125913 hartree
zpe.sumelectthermalent: -734.124969 hartree
zpe.sumelectthermalfe: -734.196280 hartree
dipole: -2.7089 -0.7560 -0.5282
dipole: 2.8616
quadrupole: -80.0868 -96.5272 -105.0509
quadrupole: 3.6976 -10.9031 2.0383
quadrupole: 13.8015 -2.6389 -11.1626 3.6976 -10.9031 2.0383
hfenergy: -734.495529 hartree
pointgroup: C01 [X(C13H24O3)]
dipole: 1.0641392 0.2984712 -0.2145861 debye
polarizability: 183.9935403|-1.7863434|138.7858584|0.8383861|0.9428149|125.9711196 unknown
InChI: InChI=1S/C13H24O3/c1-3-11(4-2)13(14)16-10-6-8-12-7-5-9-15-12/h11-12H,3-10H2,1-2H3
charge 0 multiplicity 1
40 atoms
O  3.802424 -0.763048 -0.812201
O  -1.308807 0.071574 -0.131689
O  -2.704348 0.314813 1.717054
C  3.652888 0.606046 -0.222776
C  4.97654 0.888598 0.53087
C  2.391349 0.645727 0.654402
C  6.006875 -0.007808 -0.201504
C  5.166559 -1.262351 -0.51457
C  1.10474 0.361502 -0.153458
C  -0.130362 0.351632 0.745484
C  -3.683336 -0.228152 -0.490236
C  -4.645208 0.991531 -0.581234
C  -4.441752 -1.507205 -0.033367
C  -2.558854 0.079445 0.493003
C  -3.981581 2.266788 -1.142622
C  -3.563719 -2.776298 -0.007359
H  3.534701 1.303789 -1.07882
H  5.246948 1.95799 0.510508
H  4.882834 0.576373 1.588875
H  2.326951 1.64344 1.137742
H  2.506517 -0.103117 1.463727
H  6.895838 -0.231928 0.413049
H  6.339885 0.475539 -1.13794
H  5.131154 -1.946291 0.359375
H  5.513865 -1.823872 -1.398644
H  1.208134 -0.613157 -0.662471
H  0.975805 1.129302 -0.941075
H  -0.077746 -0.436323 1.520109
H  -0.293755 1.320599 1.253937
H  -3.224833 -0.407714 -1.48099
H  -5.499254 0.70167 -1.224739
H  -5.053564 1.191105 0.428525
H  -4.866197 -1.322211 0.972486
H  -5.29493 -1.657819 -0.723758
H  -3.563052 2.089565 -2.150918
H  -4.713636 3.091437 -1.217674
H  -3.156453 2.610715 -0.492018
H  -3.114482 -2.973482 -0.998535
H  -4.160173 -3.661651 0.278857
H  -2.739665 -2.679253 0.723194
