program: Gaussian 09
title: 000227189
version: EM64L-G09RevD.01
frameworkgroup: C1[X(C12H22O3)]
method: RPBEPBE
basis: SDD
operation: Freq
keyword: #pfreq=noraman
keyword: PBEPBE/SDD
title: #p freq=noraman PBEPBE/SDD
converged: YES YES NO NO
title: Mulliken charges:
elementType: O O O C C C C C C C C C C C C H H H H H H H H H H H H H H H H H H H H H H
charge: -0.279463 -0.265872 -0.244618 -0.005018 -0.482219 -0.419131 -0.454662 -0.296371 -0.368346 -0.392806 -0.286087 -0.486878 0.256297 -0.349976 -0.683407 0.204397 0.231488 0.216625 0.209286 0.198725 0.225131 0.224876 0.189973 0.220633 0.234181 0.184632 0.205172 0.213874 0.224811 0.228418 0.238603 0.230888 0.209283 0.228258 0.207818 0.209078 0.222408
chargesum: 0.00000
title: Mulliken charges with hydrogens summed into heavy atoms:
elementType: O O O C C C C C C C C C C C C
charge: -0.279463 -0.265872 -0.244618 0.199378 -0.034105 -0.011121 -0.004656 0.114235 0.050467 0.026240 0.167142 -0.017387 0.256297 0.087565 -0.044103
polarizability: 1.85637573e+02 -1.01772304e+00 1.21562953e+02 -1.74985573e+00 -7.37898460e-01 1.12068496e+02
1716.lowfreq: -28.1999 -7.4728 -4.4731 -0.0009 0.0007 0.0010 8.6882 23.1719 26.9921
frequency: -24.8546 20.8499 26.5022 32.9361 46.5843 62.2667 72.3316 91.3748 118.7968 124.5376 168.2841 177.5496 200.4402 228.7775 235.2115 273.2064 329.1398 364.9607 386.9321 464.6749 489.5799 560.2932 567.2709 636.8797 686.3784 725.6527 737.8576 756.2223 801.3128 854.9610 857.9282 869.5648 878.6149 887.1753 902.9896 918.3447 924.5249 951.6878 1005.1118 1018.6809 1033.2346 1046.3111 1055.2086 1074.1993 1088.5543 1093.2097 1109.6819 1111.8945 1139.4612 1143.3456 1148.0632 1165.4339 1168.8752 1217.9247 1219.5319 1235.3573 1243.8735 1272.1142 1276.6632 1278.2984 1290.1508 1294.9814 1300.8378 1310.4129 1313.0384 1338.8641 1345.3839 1355.1522 1364.9291 1374.3862 1391.1812 1441.6428 1442.4978 1458.8074 1466.0824 1467.0369 1473.5858 1474.0857 1478.6544 1485.3996 1487.6083 1491.6915 1638.3593 2954.2909 2958.2398 2960.0994 2966.9108 2972.8990 2978.4988 2985.4934 2997.4701 2999.4432 3000.9793 3010.3060 3015.5376 3030.3944 3039.1592 3049.8386 3056.1055 3061.2379 3072.4699 3074.8716 3076.0366 3078.7280 3086.9266
redmass: 1.7997 3.4512 6.0150 3.9728 3.4262 3.3875 2.6316 2.3036 2.8584 2.3621 2.9781 4.9302 2.9083 1.5450 1.3529 3.1745 3.5038 3.7593 3.5240 2.4545 3.6539 2.8824 2.0226 3.5246 4.9280 1.3588 1.1974 1.5916 1.5112 2.1254 2.7331 1.8604 1.4088 2.2903 2.0778 1.5160 2.5163 3.7057 2.3212 2.5521 2.8920 2.1572 2.3848 2.3768 2.0196 1.9893 2.4107 2.0638 1.7725 2.7345 1.5005 1.4190 1.4128 1.3392 1.3391 1.2662 1.2879 1.2615 1.2044 1.1432 1.1392 1.2795 1.2978 1.2318 1.2892 1.3082 1.3652 1.6239 1.6919 1.6158 1.2157 1.0851 1.0858 1.0898 1.0975 1.0758 1.0698 1.0709 1.0426 1.0772 1.0947 1.0912 9.9365 1.0810 1.0679 1.0633 1.0640 1.0362 1.0649 1.0604 1.0630 1.0615 1.0575 1.0621 1.0935 1.1015 1.0960 1.1042 1.0978 1.0970 1.1006 1.1074 1.0991 1.1013 1.1056
irintensity: 0.0114 0.0787 0.3705 1.7222 1.7828 2.0899 0.4995 0.5090 1.7287 1.4054 2.6220 2.3526 4.5213 3.4686 2.2676 5.1441 0.5497 17.3491 0.2734 1.5215 1.8508 3.6272 1.1597 1.7224 2.9994 3.6081 14.6088 12.1728 4.4795 15.2817 6.5440 1.3158 2.5204 2.7435 13.6865 7.3121 6.7100 72.5390 62.2907 7.9844 0.9484 59.3389 6.4565 29.8100 76.3050 2.5074 34.5498 2.3710 4.2833 295.9347 2.1974 4.3482 2.0065 1.4127 4.8386 8.6401 1.5180 1.2830 23.5840 7.1366 6.1833 28.3539 26.6460 1.0833 2.4062 3.4882 11.5302 22.3284 3.6256 2.2565 8.2232 19.8870 2.4564 9.8308 10.5519 1.2070 5.4203 0.5591 12.7754 13.6622 20.1814 1.8742 180.2273 73.8970 29.4691 23.8337 30.8598 36.8819 5.7329 22.0165 32.7793 17.6934 40.3269 28.8095 20.1002 6.1803 1.7735 24.7571 1.5781 44.4758 16.0422 62.0053 56.8717 87.8939 68.2982
temp: 298.150 k
press: 1.00000 atm
elementType: 8 8 8 6 6 6 6 6 6 6 6 6 6 6 6 1 1 1 1 1 1 1 1 1 1 1 1 1 1 1 1 1 1 1 1 1 1
symmnumber: 1
zpe: 846288.1 jmol-1
zpe.correction: 0.322334 hartree
zpe.thermalcorrener: 0.339337 hartree
zpe.thermalcorrenthalpy: 0.340281 hartree
zpe.thermalcorrgfe: 0.273945 hartree
zpe.sumelectzpe: -694.921438 hartree
zpe.sumelectthermal: -694.904435 hartree
zpe.sumelectthermalent: -694.903491 hartree
zpe.sumelectthermalfe: -694.969828 hartree
dipole: -2.5290 -3.0704 0.4036
dipole: 3.9982
quadrupole: -75.5414 -98.5216 -90.3496
quadrupole: -2.1585 3.1958 2.8901
quadrupole: 12.5962 -10.3841 -2.2121 -2.1585 3.1958 2.8901
hfenergy: -695.2437722 hartree
pointgroup: C01 [X(C12H22O3)]
dipole: 1.0035087 -1.1663189 -0.3272128 debye
polarizability: 185.6089676|1.7535535|121.1980442|-1.7245659|2.0044558|112.4620102 unknown
InChI: InChI=1S/C12H22O3/c1-2-6-12(13)15-9-4-3-7-11-8-5-10-14-11/h11H,2-10H2,1H3
charge 0 multiplicity 1
37 atoms
O  4.120617 1.071143 -0.199339
O  -2.388193 -0.363707 -0.015172
O  -3.653756 1.29317 1.025825
C  3.938633 -0.241404 0.502159
C  5.174835 -1.096723 0.125736
C  2.5873 -0.851335 0.098403
C  6.25702 -0.040699 -0.213453
C  5.422035 1.053146 -0.908779
C  1.384348 0.021957 0.514972
C  0.035583 -0.569079 0.044583
C  -1.143575 0.296586 0.487437
C  -4.7771 -0.562481 -0.174811
C  -3.596387 0.241869 0.346183
C  -6.067282 0.275443 -0.30411
C  -7.280615 -0.591809 -0.698498
H  3.938407 -0.014877 1.589705
H  5.476611 -1.773179 0.94335
H  4.949685 -1.712416 -0.766373
H  2.583747 -0.994304 -1.000869
H  2.49893 -1.858062 0.558918
H  7.05993 -0.438712 -0.857815
H  6.713289 0.354267 0.712529
H  5.260895 0.809921 -1.980265
H  5.8559 2.064675 -0.829742
H  1.527111 1.036235 0.095206
H  1.378269 0.133577 1.619625
H  -0.094331 -1.591764 0.44977
H  0.027883 -0.656946 -1.059001
H  -1.211289 0.382616 1.588062
H  -1.09495 1.3179 0.066384
H  -4.494999 -1.028977 -1.136044
H  -4.945781 -1.399598 0.53422
H  -5.911761 1.072437 -1.056336
H  -6.257391 0.790765 0.655105
H  -7.476522 -1.371732 0.061724
H  -7.115341 -1.100706 -1.667023
H  -8.194055 0.022805 -0.792967
