program: Gaussian 09
title: 000227187
version: EM64L-G09RevD.01
frameworkgroup: C1[X(C11H18O4)]
method: RPBEPBE
basis: SDD
operation: Freq
keyword: #pfreq=noraman
keyword: PBEPBE/SDD
title: #p freq=noraman PBEPBE/SDD
converged: YES YES NO NO
title: Mulliken charges:
elementType: O O O O C C C C C C C C C C C H H H H H H H H H H H H H H H H H H
charge: -0.264189 -0.267978 -0.266037 -0.258510 -0.410622 -0.460226 -0.272122 -0.188403 -0.489161 -0.142440 -0.250109 0.310087 0.303481 -0.749682 -0.787634 0.223306 0.198633 0.207486 0.222694 0.226624 0.265295 0.224754 0.221682 0.203428 0.220456 0.231023 0.226809 0.247461 0.246023 0.247663 0.232617 0.310707 0.236883
chargesum: 0.00000
title: Mulliken charges with hydrogens summed into heavy atoms:
elementType: O O O O C C C C C C C C C C C
charge: -0.264189 -0.267978 -0.266037 -0.258510 0.011317 -0.030046 0.219796 0.036351 -0.064051 0.078017 0.207724 0.310087 0.303481 -0.008535 -0.007427
polarizability: 1.40623892e+02 -1.03938576e+01 1.35125568e+02 9.30070577e+00 -3.37772580e+00 1.17246934e+02
1716.lowfreq: -44.9743 -10.5826 -0.0010 -0.0007 -0.0005 1.1512 7.6236 21.8933 30.2943
frequency: -44.9256 21.7225 30.2271 36.6176 48.7726 74.5973 90.5647 99.1340 141.7615 146.1610 166.6615 176.1585 199.9247 212.8039 232.3811 267.4968 303.0580 375.8703 399.8248 408.2660 444.8185 470.6607 500.1996 567.8233 575.6831 602.1451 608.1420 749.2322 776.2364 798.3372 837.0431 866.0894 880.9276 912.5898 922.6084 950.1895 971.6365 978.4809 999.7939 1005.9918 1027.6258 1042.2322 1052.2560 1058.9541 1091.4835 1103.4372 1120.8106 1167.6279 1193.1729 1198.8037 1213.3907 1217.2909 1225.0944 1266.4420 1276.8805 1293.0142 1318.6694 1348.3739 1353.2136 1356.8564 1371.2788 1383.2794 1396.1179 1447.5652 1451.0578 1452.6234 1454.7811 1457.0794 1462.6627 1467.8090 1475.4336 1475.5247 1640.6249 1647.6809 1691.9273 2966.0797 2975.6668 2986.4259 2994.0991 3002.1040 3007.9249 3009.8684 3040.6064 3041.6756 3051.7111 3064.3474 3068.7168 3076.6788 3079.2711 3089.2901 3095.9536 3135.1344 3143.9993
redmass: 1.0556 4.2477 4.5724 7.4910 8.8888 4.0044 3.2170 3.8859 1.5809 1.5710 3.2143 3.6426 3.2758 2.7677 2.2694 2.9961 2.4962 2.6792 2.9246 2.4656 3.0709 2.6372 2.0650 2.9993 3.2314 4.9030 4.6329 1.6485 2.6248 2.2710 2.2509 2.5682 2.2045 4.0039 2.7611 2.6054 1.7930 1.1895 1.8815 2.1484 1.8917 1.6725 2.2438 1.6271 2.0437 2.1868 2.3738 1.3222 1.2856 2.4325 1.3250 3.2023 1.2168 1.1841 1.2445 1.2754 1.3515 1.3795 1.4683 1.3700 1.4123 1.2920 1.2442 1.0948 1.0848 1.0672 1.0478 1.0479 1.0994 1.0616 1.0796 1.0770 8.8652 9.1985 6.6476 1.0639 1.0623 1.0618 1.0391 1.0582 1.0376 1.0581 1.0965 1.0960 1.0975 1.0992 1.1014 1.0903 1.1076 1.0940 1.0973 1.1013 1.1009
irintensity: 1.1538 0.0520 0.4867 1.4993 0.9304 1.4210 0.9099 1.0422 3.7964 2.6364 4.6706 8.0267 7.3691 0.5670 11.1416 4.6516 2.5290 5.8437 2.3693 3.1533 2.1148 7.1277 0.8728 3.7634 2.5658 6.8004 3.0749 2.5620 7.7935 8.4637 6.9875 3.2979 0.0668 54.1613 13.2482 20.0048 19.5647 58.9188 43.8472 85.0866 3.3096 10.8157 26.9992 18.6735 16.3974 4.9594 11.5282 2.5044 6.7654 180.7138 11.8143 378.3184 17.8643 6.1730 1.1615 0.2082 3.2771 0.6422 0.8878 1.1464 4.3411 51.3575 49.6080 15.1854 15.3009 25.1130 14.7570 22.0885 14.3594 29.8491 10.6241 10.0795 265.5076 159.8089 0.1269 29.7655 28.9681 39.2768 29.2487 32.7283 1.6655 25.9463 23.3955 7.1674 14.7974 13.1698 5.5409 96.7344 23.7541 10.6201 8.3985 11.2220 9.0123
temp: 298.150 k
press: 1.00000 atm
elementType: 8 8 8 8 6 6 6 6 6 6 6 6 6 6 6 1 1 1 1 1 1 1 1 1 1 1 1 1 1 1 1 1 1
symmnumber: 1
zpe: 717049.2 jmol-1
zpe.correction: 0.273110 hartree
zpe.thermalcorrener: 0.290254 hartree
zpe.thermalcorrenthalpy: 0.291198 hartree
zpe.thermalcorrgfe: 0.225627 hartree
zpe.sumelectzpe: -729.670091 hartree
zpe.sumelectthermal: -729.652947 hartree
zpe.sumelectthermalent: -729.652002 hartree
zpe.sumelectthermalfe: -729.717574 hartree
dipole: -3.1052 2.4878 -0.2545
dipole: 3.9871
quadrupole: -93.5910 -90.9679 -83.8273
quadrupole: 9.4011 -3.2804 -1.7421
quadrupole: -4.1290 -1.5058 5.6348 9.4011 -3.2804 -1.7421
hfenergy: -729.9432005 hartree
pointgroup: C01 [X(C11H18O4)]
dipole: 1.2252252 -0.9708572 -0.1298237 debye
polarizability: 140.6829607|-10.0917625|134.8366787|-9.6358117|3.8686084|117.4767558 unknown
InChI: InChI=1S/C11H18O4/c1-10(12)14-8-6-4-3-5-7-9-15-11(2)13/h3-4H,5-9H2,1-2H3
charge 0 multiplicity 1
33 atoms
O  2.429063 0.7401 0.165246
O  -2.176471 -0.24717 -0.396695
O  0.9003 2.442499 -0.267855
O  -3.493964 1.400091 0.592422
C  2.694006 -1.310915 -1.119969
C  2.172876 -2.272533 -0.013674
C  2.012482 0.057643 -1.103026
C  0.695086 -2.566578 -0.166413
C  -1.750066 -2.459028 0.543879
C  -0.265616 -2.224541 0.729256
C  -2.581236 -1.177239 0.695192
C  1.785129 1.939092 0.463741
C  -2.709088 1.051384 -0.319592
C  2.306908 2.519776 1.760767
C  -2.179342 1.915559 -1.438202
H  3.78775 -1.179543 -1.016149
H  2.514518 -1.761558 -2.117289
H  2.757423 -3.213098 -0.071808
H  2.371294 -1.825607 0.977785
H  2.329628 0.693422 -1.949716
H  0.911019 -0.026128 -1.108052
H  0.391915 -3.057364 -1.106065
H  -1.945439 -2.913963 -0.444804
H  -2.124045 -3.171788 1.309554
H  0.032005 -1.719729 1.663018
H  -3.664461 -1.37763 0.601726
H  -2.407912 -0.679762 1.667734
H  3.3838 2.744812 1.669286
H  2.193213 1.788762 2.579601
H  1.755502 3.439614 2.00196
H  -2.128756 1.347049 -2.381209
H  -1.1545 2.247629 -1.18674
H  -2.82382 2.799246 -1.556708
