program: Gaussian 09
title: 000227184
version: EM64L-G09RevD.01
frameworkgroup: C1[X(C10H18O3)]
method: RPBEPBE
basis: SDD
operation: Freq
keyword: #pfreq=noraman
keyword: PBEPBE/SDD
title: #p freq=noraman PBEPBE/SDD
converged: YES YES NO NO
title: Mulliken charges:
elementType: O O O C C C C C C C C C C H H H H H H H H H H H H H H H H H H
charge: -0.279596 -0.257199 -0.250902 -0.004342 -0.481935 -0.417931 -0.455014 -0.296124 -0.370849 -0.393640 -0.283529 0.285911 -0.752041 0.204108 0.231658 0.216380 0.208897 0.198725 0.225392 0.224870 0.189993 0.220597 0.234664 0.185159 0.214329 0.206262 0.228113 0.231169 0.246661 0.246029 0.244182
chargesum: 0.00000
title: Mulliken charges with hydrogens summed into heavy atoms:
elementType: O O O C C C C C C C C C C
charge: -0.279596 -0.257199 -0.250902 0.199766 -0.033898 -0.010308 -0.004751 0.114467 0.048975 0.026950 0.175754 0.285911 -0.015169
polarizability: 1.52657750e+02 8.58910136e-01 1.03558645e+02 1.03670061e+00 -2.52750642e+00 9.48732255e+01
1716.lowfreq: -8.7422 -3.6348 0.0005 0.0006 0.0009 6.2825 13.7356 24.2072 27.0617
frequency: 3.3153 24.1375 26.7142 43.3222 55.4041 67.1500 112.3511 129.0820 139.5839 189.4762 193.6879 227.8870 270.1736 366.3834 383.6667 467.0358 476.9570 566.6025 568.5546 613.3372 637.7889 726.8732 757.2950 802.6100 831.7918 855.5381 879.6064 903.4139 919.5272 924.2811 935.5439 1001.5718 1005.4864 1019.0444 1033.6145 1041.2867 1046.7926 1074.8327 1092.7198 1112.5036 1138.8421 1147.2602 1167.2735 1170.1136 1207.9424 1217.3603 1236.4130 1244.9878 1273.7811 1279.5123 1292.4133 1301.6174 1310.1350 1314.0381 1338.8761 1347.2450 1366.8382 1372.2377 1382.3855 1444.6624 1453.5061 1455.0467 1461.4721 1468.6339 1469.2888 1474.6235 1487.9463 1491.0760 1648.3306 2954.3016 2958.0167 2960.5814 2967.5175 2986.7810 2997.6826 3001.2497 3007.4524 3011.0032 3016.2718 3031.0780 3050.7643 3061.0899 3073.2962 3075.5689 3087.7013 3095.7891 3142.8666
redmass: 1.1704 4.1481 3.0706 3.8649 3.8706 2.9530 2.1777 2.3435 3.1871 2.8181 4.9935 2.2253 2.5185 3.6187 3.3409 2.5737 3.1586 2.9902 1.9978 4.6374 3.5837 1.4025 1.5466 1.4996 6.1433 2.0452 1.4006 2.0923 1.5333 2.5100 4.9411 2.1180 2.3027 2.5539 2.8856 1.6693 2.1629 2.3784 2.2833 2.0173 1.7487 1.5156 1.3488 1.4752 3.6005 1.3358 1.2610 1.2901 1.2708 1.1370 1.1196 1.2660 1.2188 1.3236 1.3011 1.3729 1.6664 1.4667 1.3275 1.0865 1.0636 1.0474 1.0912 1.0759 1.0975 1.0860 1.0953 1.0926 9.1677 1.0794 1.0725 1.0606 1.0644 1.0604 1.0634 1.0570 1.0367 1.0622 1.0936 1.1014 1.1039 1.0969 1.1004 1.1074 1.1056 1.0974 1.1010
irintensity: 0.8420 1.2754 0.3309 2.8184 0.8341 1.7202 1.8986 1.7560 2.0495 6.1024 3.1303 2.5157 3.6246 14.3643 1.6936 1.4412 0.0086 2.6935 1.3092 5.2919 1.8627 3.6140 13.1897 4.3729 18.9100 14.7729 2.9289 13.9912 7.0851 7.9087 26.5735 116.7371 43.4668 15.5935 0.8915 8.5816 52.6185 17.4951 10.1744 1.8343 2.5617 0.9008 2.6640 8.6003 377.0311 1.1635 8.9674 5.1408 1.8266 1.5415 2.1543 11.9161 1.4964 1.2788 1.9856 7.1919 2.0799 11.0741 42.3106 2.8026 28.5869 17.9694 9.9087 0.4370 10.9638 0.5791 17.7495 2.2635 202.6107 86.2020 25.9346 16.4807 30.0491 20.6474 33.0734 30.7065 4.9572 28.3602 22.4466 5.5037 22.8461 44.9051 15.3600 82.2699 66.9556 9.7057 11.8669
temp: 298.150 k
press: 1.00000 atm
elementType: 8 8 8 6 6 6 6 6 6 6 6 6 6 1 1 1 1 1 1 1 1 1 1 1 1 1 1 1 1 1 1
symmnumber: 1
zpe: 699634.9 jmol-1
zpe.correction: 0.266477 hartree
zpe.thermalcorrener: 0.281730 hartree
zpe.thermalcorrenthalpy: 0.282674 hartree
zpe.thermalcorrgfe: 0.218082 hartree
zpe.sumelectzpe: -616.474818 hartree
zpe.sumelectthermal: -616.459565 hartree
zpe.sumelectthermalent: -616.458620 hartree
zpe.sumelectthermalfe: -616.523213 hartree
dipole: 2.8329 -3.0768 0.7759
dipole: 4.2537
quadrupole: -70.8179 -84.3949 -77.6265
quadrupole: 6.3479 -5.5227 2.9385
quadrupole: 6.7952 -6.7818 -0.0134 6.3479 -5.5227 2.9385
hfenergy: -616.7412946 hartree
pointgroup: C01 [X(C10H18O3)]
dipole: -1.1218166 1.2020134 0.3121713 debye
polarizability: 152.6571859|1.0904768|103.5152884|-0.7568855|2.6164924|94.9171467 unknown
InChI: InChI=1S/C10H18O3/c1-9(11)12-7-3-2-5-10-6-4-8-13-10/h10H,2-8H2,1H3
charge 0 multiplicity 1
31 atoms
O  -3.078123 -1.081186 0.14523
O  3.401397 0.430073 0.291732
O  4.743993 -1.231124 -0.642705
C  -2.88352 0.223598 -0.56801
C  -4.15055 1.062515 -0.265395
C  -1.563068 0.860944 -0.108998
C  -5.231377 -0.008177 0.029398
C  -4.416086 -1.078029 0.783175
C  -0.328612 -0.000316 -0.452581
C  0.985034 0.612814 0.083823
C  2.196667 -0.242908 -0.28413
C  4.631665 -0.182255 0.03227
C  5.757224 0.599346 0.677102
H  -2.827295 -0.018927 -1.650712
H  -4.42064 1.725936 -1.104417
H  -3.981638 1.689845 0.630967
H  -1.614946 1.020541 0.986764
H  -1.46713 1.861802 -0.580701
H  -6.074715 0.383107 0.624152
H  -5.629523 -0.422994 -0.914606
H  -4.317259 -0.818442 1.858385
H  -4.827583 -2.098108 0.694779
H  -0.480666 -1.012211 -0.030376
H  -0.262735 -0.1224 -1.554179
H  0.931214 0.710805 1.185271
H  1.124275 1.633209 -0.323849
H  2.333039 -0.330906 -1.378104
H  2.131273 -1.263822 0.135907
H  5.60741 0.648407 1.769629
H  5.764569 1.636794 0.300537
H  6.718807 0.114969 0.455242
