program: Gaussian 09
title: 000227183
version: EM64L-G09RevD.01
frameworkgroup: C1[X(C10H10O2)]
method: RPBEPBE
basis: SDD
operation: Freq
keyword: #pfreq=noraman
keyword: PBEPBE/SDD
title: #p freq=noraman PBEPBE/SDD
converged: YES YES NO NO
title: Mulliken charges:
elementType: O O C C C C C C C C C C H H H H H H H H H H
charge: -0.243663 -0.245294 0.353963 -0.312567 -0.390432 -0.197616 -0.250920 -0.130292 -0.163168 -0.312432 0.182973 -0.783317 0.244239 0.261854 0.256939 0.258142 0.262396 0.264381 0.225111 0.253624 0.233354 0.232723
chargesum: 0.00000
title: Mulliken charges with hydrogens summed into heavy atoms:
elementType: O O C C C C C C C C C C
charge: -0.243663 -0.245294 0.353963 -0.068328 -0.128578 0.059323 0.007223 0.132104 0.101213 -0.087321 0.182973 -0.063615
polarizability: 3.26712707e+02 -1.02393735e+01 1.07922370e+02 -2.78492623e-02 1.19627304e-02 5.13992877e+01
1716.lowfreq: -2.9124 -0.0008 -0.0003 0.0007 3.2151 8.4580 49.3852 55.9254 57.4869
frequency: 49.3129 55.8974 57.4829 75.3336 117.7448 142.2020 209.7767 258.3296 260.7978 310.3762 375.7050 442.1083 495.7766 569.3807 583.8379 601.2370 656.5745 735.2933 746.6526 806.9202 842.7426 868.0321 875.1422 882.8026 897.5854 898.2287 949.1736 950.5438 1016.4282 1016.5280 1027.9229 1052.6583 1133.9151 1152.4883 1172.4436 1220.0414 1236.7548 1261.8290 1280.3366 1298.3284 1324.7942 1366.5195 1373.4297 1441.8357 1456.0191 1463.2575 1530.3987 1556.1108 1632.3475 1634.7160 2977.7129 3060.1528 3093.4005 3111.2078 3118.0699 3123.4439 3128.8152 3220.1904 3235.4268 3267.6193
redmass: 3.2498 3.3971 4.7036 1.2898 3.6768 6.6562 2.9189 2.4233 4.1414 4.9097 3.2760 3.4600 4.1874 2.4898 2.9477 4.2270 4.2380 1.2677 4.5903 1.3193 1.5586 6.6663 4.5342 1.3688 1.6944 4.1732 1.2653 1.6810 1.2886 1.6690 1.4775 2.3061 1.5911 2.4284 1.3938 1.5286 2.1513 2.7220 1.7433 1.2937 2.0695 1.2799 2.5129 1.1204 1.0501 4.9016 5.2501 6.1483 6.1618 5.8620 1.0375 1.0965 1.0915 1.0915 1.0932 1.0991 1.0866 1.0926 1.0979 1.1083
irintensity: 5.2292 1.1734 0.8192 0.2300 0.6161 2.1432 2.7534 0.3119 0.9987 9.7524 1.6943 11.8571 6.2306 0.5679 9.1060 10.6077 0.6903 87.1654 7.1738 16.6645 17.7574 16.9501 13.9593 0.0036 0.0319 1.3638 11.2760 101.7179 93.6711 19.0252 15.4412 44.0981 1.6339 99.0383 11.0288 0.5168 128.9728 4.5145 20.5363 2.8252 140.2533 71.3049 15.1287 56.8512 19.6263 122.0603 91.9538 363.8415 97.2439 106.1243 4.3838 16.5367 0.3883 10.2093 0.3463 24.8328 17.4343 5.6538 1.2328 0.0014
temp: 298.150 k
press: 1.00000 atm
elementType: 8 8 6 6 6 6 6 6 6 6 6 6 1 1 1 1 1 1 1 1 1 1
symmnumber: 1
zpe: 446806.0 jmol-1
zpe.correction: 0.170179 hartree
zpe.thermalcorrener: 0.182031 hartree
zpe.thermalcorrenthalpy: 0.182976 hartree
zpe.thermalcorrgfe: 0.130621 hartree
zpe.sumelectzpe: -536.597137 hartree
zpe.sumelectthermal: -536.585285 hartree
zpe.sumelectthermalent: -536.584341 hartree
zpe.sumelectthermalfe: -536.636695 hartree
dipole: -4.1699 -2.1148 0.0147
dipole: 4.6756
quadrupole: -63.5577 -66.0948 -74.6503
quadrupole: -13.3788 0.0371 0.0159
quadrupole: 4.5432 2.0061 -6.5494 -13.3788 0.0371 0.0159
hfenergy: -536.7673164 hartree
pointgroup: C01 [X(C10H10O2)]
dipole: 1.6484742 -0.8125772 -0.077819 debye
dipolederiv: -0.1867353 -0.1883154 -0.0108937 -0.242891 -0.4917452 -0.020381 -0.0157603 -0.0209116 -0.1309858 -1.0314848 0.0180651 0.0088573 0.8047983 -0.7952186 -0.0417068 0.0605655 -0.0323636 -0.3312781 -0.482273 0.0750298 0.0107888 -0.0143229 0.2734514 0.0140645 0.0064987 0.0131167 0.0538203 0.9200866 -0.0018893 -0.0120509 0.0741988 0.1201917 0.0160838 -0.0074643 0.0168535 -0.1334641 0.3694693 -0.0776858 -0.0116115 -0.1488329 0.0136543 0.015528 -0.0165756 0.01456 -0.2010424 -0.8729611 -0.0015553 0.007875 -0.2091674 0.0739179 0.0176728 -0.0051412 0.0154354 -0.1562549 -0.0149972 -0.0059418 -0.0028142 0.5145552 -0.13473 -0.0012455 0.0301355 0.0045488 -0.2043808 1.1695043 0.0500149 -0.0104151 0.1149226 0.0979262 0.0093124 -0.0057101 0.0099464 -0.0606285 -0.4174044 0.137811 0.0115345 0.0945472 0.2040671 0.019422 0.00975 0.0192139 -0.1183826 -1.9725444 -0.1060525 0.0117761 -0.2702786 0.0494059 0.0231474 0.0002588 0.0210263 -0.247346 2.5635585 0.2303424 -0.0097826 -0.5840301 0.8468454 0.0575702 -0.0608827 0.0487147 0.1305859 -0.4098037 -0.2556229 -0.0136148 -0.469781 -0.2898374 -0.0210716 -0.0352872 -0.0260215 0.0556397 0.0479362 0.0243751 0.003027 0.0552219 -0.0538873 -0.0152961 0.0047491 -0.0149677 0.1683883 0.1371774 0.0240437 0.0024101 0.0173199 -0.0171832 -0.0142794 0.0022865 -0.0142669 0.2019823 0.0343746 0.0060295 0.0019404 0.0649042 -0.0493112 -0.0154271 0.0058023 -0.0147769 0.1710868 -0.0578122 -0.0199027 0.0019194 -0.0201015 0.1305063 -0.0043514 0.0017965 -0.0044178 0.2022623 0.0679483 0.0016551 0.0011192 0.0248489 -0.0418843 -0.0134286 0.0024745 -0.0131869 0.1548807 0.0849607 0.0167038 0.0027218 0.0242579 0.0265641 -0.0126557 0.0037432 -0.0127055 0.2197676 0.0583246 0.0323667 0.0033961 0.0258584 -0.1085219 -0.0189893 0.0030731 -0.0188876 0.1694234 -0.1188537 0.0356287 0.0072024 0.1184544 0.0568153 -0.0070069 0.0151473 -0.0046524 0.1204667 0.0565626 -0.0042359 0.0545294 0.0107615 0.0618826 -0.0914249 0.0043725 -0.1067251 -0.0501395 0.0549667 0.0091358 -0.0579148 0.0147559 0.0270907 0.1044631 -0.003832 0.1204681 -0.0144013 unknown
polarizability: 326.4573076|12.5525981|107.9157446|-2.2366164|3.5913607|51.6613122 unknown
InChI: InChI=1S/C10H10O2/c1-9(11)5-2-3-6-10-7-4-8-12-10/h2-8H,1H3
charge 0 multiplicity 1
22 atoms
O  2.628493 -1.014514 -0.090979
O  -4.271113 1.238559 0.134826
C  2.282942 0.361243 0.001169
C  0.894384 0.727401 0.041045
C  3.461874 1.114871 0.035419
C  -0.172609 -0.14938 -0.004781
C  4.569608 0.197431 -0.037598
C  -1.545124 0.29278 0.039972
C  4.029316 -1.078898 -0.111811
C  -2.6433 -0.539188 -0.00327
C  -4.027294 -0.006858 0.047714
C  -5.156031 -1.032454 -0.012779
H  0.700078 1.805511 0.114209
H  3.516443 2.199907 0.104146
H  0.028095 -1.2263 -0.078433
H  5.628504 0.447106 -0.034945
H  -1.746732 1.372516 0.114194
H  4.453595 -2.076824 -0.180574
H  -2.515149 -1.627894 -0.077421
H  -6.130592 -0.524335 0.044646
H  -5.101537 -1.613178 -0.953612
H  -5.06985 -1.756203 0.820264
