program: Gaussian 09
title: 000227182
version: EM64L-G09RevD.01
frameworkgroup: C1[X(C8H18O3)]
method: RPBEPBE
basis: SDD
operation: Freq
keyword: #pfreq=noraman
keyword: PBEPBE/SDD
title: #p freq=noraman PBEPBE/SDD
converged: YES YES NO NO
title: Mulliken charges:
elementType: O O O C C C C C C C C H H H H H H H H H H H H H H H H H H
charge: -0.439063 -0.468954 -0.450831 -0.055624 -0.443433 -0.372263 -0.427667 -0.029887 -0.352127 -0.342887 -0.718197 0.205639 0.239309 0.189397 0.190348 0.234350 0.189693 0.194850 0.177851 0.209564 0.244216 0.186705 0.182457 0.233961 0.217034 0.204673 0.323515 0.337949 0.339421
chargesum: 0.00000
title: Mulliken charges with hydrogens summed into heavy atoms:
elementType: O O O C C C C C C C C
charge: -0.115548 -0.131005 -0.111410 0.150015 -0.014727 0.052435 -0.043124 0.147964 0.101653 0.026275 -0.062529
polarizability: 1.25809052e+02 -7.25881768e-01 8.65609391e+01 -2.78382863e-01 2.08185322e+00 8.44969999e+01
1716.lowfreq: -4.6059 -3.2505 -0.0006 -0.0004 0.0002 20.0482 35.4165 46.2001 58.3738
frequency: 35.1437 45.5629 58.3110 72.0043 86.3227 139.4448 145.6900 157.9906 222.9241 229.9682 269.1599 274.3413 285.8422 296.5944 314.0464 376.8282 415.9167 436.9871 462.0156 518.9856 546.8098 759.5199 766.9928 803.0570 833.5055 880.7571 912.9540 958.3395 970.2924 989.6171 1017.4890 1040.9910 1049.3483 1064.7574 1073.9244 1082.6753 1106.3400 1123.5387 1147.4376 1160.5232 1207.5186 1232.1419 1244.2243 1256.7777 1276.7692 1279.7094 1283.1396 1313.7591 1318.7547 1333.1855 1355.0578 1360.7148 1364.7155 1384.3262 1386.9474 1415.0723 1447.1977 1455.9556 1466.6744 1468.7568 1472.3796 1473.1779 1488.6720 2920.3777 2923.6341 2948.6072 2966.4596 2967.1773 2971.7708 2986.0846 2998.3666 3001.6642 3011.5905 3033.1098 3059.1669 3062.3663 3073.7973 3085.5698 3534.5285 3562.4168 3563.8952
redmass: 4.1586 4.0772 2.8734 3.5216 2.4970 2.8117 2.8016 2.6187 3.2046 1.1690 2.7090 1.1388 1.1311 1.9399 1.4561 2.9626 2.5321 3.0521 2.3116 2.8366 3.0727 1.4083 1.3222 2.7930 1.6341 1.5415 1.8922 1.6688 4.7807 3.4685 1.9227 2.5011 2.4382 1.6156 1.5531 2.1602 2.1557 2.4852 1.3681 1.2382 1.2554 1.3166 1.3249 1.2460 1.2737 1.1838 1.1057 1.2771 1.2621 1.2743 1.3831 1.5120 1.3097 1.5329 1.3618 1.4471 1.0791 1.0863 1.0815 1.0536 1.0717 1.0808 1.0901 1.0544 1.0839 1.0605 1.0598 1.1063 1.0374 1.0622 1.0793 1.0765 1.0924 1.0940 1.1012 1.0983 1.1024 1.0996 1.0656 1.0661 1.0664
irintensity: 1.1174 2.2298 5.7666 4.1813 0.7573 1.0861 1.2942 6.0936 0.8837 0.9908 16.8128 126.2237 149.9641 31.1489 166.2040 11.9148 26.3198 0.7645 3.5990 10.6490 14.1656 2.6317 1.1387 9.7092 18.5373 17.3624 22.6915 25.7039 77.8131 9.3759 36.6494 8.0380 26.5800 29.7381 22.2107 21.4749 21.2910 11.4407 9.3878 3.2000 23.1962 32.0891 26.2159 5.7768 6.3185 3.9147 2.2548 10.2711 5.3926 10.7679 12.2267 9.7256 18.9812 37.1095 4.9626 7.5582 1.1839 0.7351 3.7393 14.8897 10.3684 8.4949 8.9074 64.8477 64.1994 30.0172 32.5046 60.0552 25.4948 28.0245 29.9421 10.6534 12.8425 42.5891 27.2277 49.8483 54.0109 44.8058 3.9697 3.9977 2.1389
temp: 298.150 k
press: 1.00000 atm
elementType: 8 8 8 6 6 6 6 6 6 6 6 1 1 1 1 1 1 1 1 1 1 1 1 1 1 1 1 1 1
symmnumber: 1
zpe: 664460.7 jmol-1
zpe.correction: 0.253080 hartree
zpe.thermalcorrener: 0.267750 hartree
zpe.thermalcorrenthalpy: 0.268694 hartree
zpe.thermalcorrgfe: 0.210654 hartree
zpe.sumelectzpe: -540.355494 hartree
zpe.sumelectthermal: -540.340824 hartree
zpe.sumelectthermalent: -540.339880 hartree
zpe.sumelectthermalfe: -540.397921 hartree
dipole: 1.9685 3.5494 -1.2763
dipole: 4.2546
quadrupole: -55.6756 -72.3527 -67.5889
quadrupole: -9.1617 -2.7435 2.3514
quadrupole: 9.5302 -7.1470 -2.3832 -9.1617 -2.7435 2.3514
hfenergy: -540.608574 hartree
pointgroup: C01 [X(C8H18O3)]
dipole: 0.7896514 -1.404311 0.4541944 debye
polarizability: 125.791186|1.1222186|86.4395286|0.2065794|2.1465976|84.636276 unknown
InChI: InChI=1S/C8H18O3/c1-7(10)4-5-8(11)3-2-6-9/h7-11H,2-6H2,1H3
charge 0 multiplicity 1
29 atoms
O  -0.360305 1.164748 -1.100989
O  3.475318 -1.002973 -1.011699
O  -5.372268 0.183542 0.059922
C  -0.388266 0.350149 0.138411
C  0.929317 -0.435847 0.30674
C  2.171834 0.476305 0.36821
C  -1.632519 -0.56609 0.162984
C  3.492725 -0.305173 0.298892
C  -2.957549 0.22592 0.14032
C  -4.181717 -0.685187 0.029057
C  4.728861 0.603467 0.418162
H  -0.478465 1.117088 0.931735
H  1.048468 -1.143424 -0.538659
H  0.864703 -1.048695 1.229518
H  2.159671 1.071255 1.303395
H  2.139259 1.191185 -0.475532
H  -1.582037 -1.255128 -0.708275
H  -1.588077 -1.20359 1.070414
H  3.514013 -1.066958 1.112198
H  -3.051491 0.829638 1.063915
H  -2.94962 0.933444 -0.708465
H  -4.13988 -1.263266 -0.921072
H  -4.201352 -1.408154 0.875281
H  4.731958 1.351538 -0.39495
H  4.732348 1.139587 1.38533
H  5.668439 0.020261 0.356519
H  -0.170351 0.553942 -1.859984
H  4.343883 -1.461279 -1.141113
H  -6.1877 -0.372008 -0.025465
