program: Gaussian 09
title: 000227180
version: EM64L-G09RevD.01
frameworkgroup: C1[X(C8H14O2)]
method: RPBEPBE
basis: SDD
operation: Freq
keyword: #pfreq=noraman
keyword: PBEPBE/SDD
title: #p freq=noraman PBEPBE/SDD
converged: YES YES NO NO
title: Mulliken charges:
elementType: O O C C C C C C C C H H H H H H H H H H H H H H
charge: -0.290868 -0.281400 0.401721 -0.519620 -0.519369 -0.481949 0.013820 -0.481316 -0.285884 -0.705643 0.219738 0.240612 0.219457 0.243099 0.236492 0.224792 0.205929 0.246635 0.227258 0.214822 0.202653 0.203861 0.226991 0.238173
chargesum: 0.00000
title: Mulliken charges with hydrogens summed into heavy atoms:
elementType: O O C C C C C C C C
charge: -0.290868 -0.281400 0.401721 -0.059270 -0.056813 -0.020666 0.219748 -0.007423 0.131591 -0.036619
polarizability: 1.02245554e+02 -8.10029325e-01 8.47566905e+01 1.00448697e+00 -9.53860312e-01 7.69643803e+01
1716.lowfreq: -28.5502 -11.2240 0.0005 0.0005 0.0006 16.9283 44.8816 78.8447 126.3463
frequency: 44.5710 78.7635 126.3256 134.1744 225.3720 256.2030 324.0193 386.8901 409.6533 438.3877 485.7458 594.9518 619.2689 676.8456 732.7082 756.7611 809.1672 842.1189 857.7788 890.4786 904.2617 912.2981 959.0431 966.7914 992.2018 1007.2245 1032.0250 1051.1654 1107.2488 1122.7233 1129.8386 1144.1661 1162.5263 1193.9893 1202.8134 1213.8350 1230.2322 1289.8134 1300.0801 1309.9853 1315.7930 1331.3257 1338.9636 1346.3371 1382.1889 1449.4644 1452.0220 1458.9746 1469.7811 1470.5131 1478.2736 1491.3314 2979.6179 2984.9274 2994.8757 3013.9368 3017.2158 3019.3788 3028.2720 3053.3497 3076.8276 3081.9528 3091.8742 3098.2174 3102.3532 3107.5165
redmass: 2.9382 3.0622 2.5488 2.1792 1.0955 2.0249 2.4461 4.1237 2.3782 2.7544 4.4785 2.3985 2.1875 3.4993 5.6251 5.0757 2.4900 1.6605 2.1862 1.7265 2.0440 3.0258 2.1699 1.3975 2.1417 2.3439 2.5612 2.1424 1.7205 2.3573 2.1534 1.2109 1.6538 1.4131 1.5004 1.5597 1.4189 1.3511 1.2649 1.2833 1.2544 1.6032 1.6566 1.5521 1.2491 1.1017 1.0893 1.0519 1.0898 1.0871 1.0576 1.0910 1.0442 1.0778 1.0580 1.0614 1.0616 1.0645 1.0629 1.1067 1.0978 1.1034 1.1034 1.1011 1.1027 1.1032
irintensity: 1.4072 7.4969 1.6517 1.9602 0.2806 1.4339 4.4573 3.7167 0.3394 0.4811 4.6150 2.8864 0.4701 8.4426 12.7026 73.1827 44.1910 7.2210 30.8212 3.9801 12.6671 22.2992 79.1712 30.4551 30.7516 45.5120 2.0429 56.5192 16.0774 24.6805 9.7541 11.3871 1.1938 2.3757 2.5849 13.5188 23.5936 0.7615 0.6829 3.0289 4.6894 16.3615 21.2162 9.5004 22.1151 1.3896 16.9791 6.3771 4.1306 27.0736 4.9464 0.9016 23.3252 54.5921 73.7897 11.6642 33.7769 35.2416 34.2621 26.1308 30.7239 26.8632 23.5143 17.5822 27.5515 49.7073
temp: 298.150 k
press: 1.00000 atm
elementType: 8 8 6 6 6 6 6 6 6 6 1 1 1 1 1 1 1 1 1 1 1 1 1 1
symmnumber: 1
zpe: 547636.8 jmol-1
zpe.correction: 0.208584 hartree
zpe.thermalcorrener: 0.218427 hartree
zpe.thermalcorrenthalpy: 0.219371 hartree
zpe.thermalcorrgfe: 0.173137 hartree
zpe.sumelectzpe: -462.883730 hartree
zpe.sumelectthermal: -462.873887 hartree
zpe.sumelectthermalent: -462.872943 hartree
zpe.sumelectthermalfe: -462.919177 hartree
dipole: 0.3061 1.0645 -0.3155
dipole: 1.1517
quadrupole: -53.0434 -58.8892 -64.4100
quadrupole: -1.2861 -0.0556 -0.9647
quadrupole: 5.7375 -0.1083 -5.6291 -1.2861 -0.0556 -0.9647
hfenergy: -463.0923143 hartree
pointgroup: C01 [X(C8H14O2)]
dipole: 0.1205328 0.384603 -0.2070537 debye
dipolederiv: -1.2008319 -0.1575835 -0.0698591 -0.3066323 -0.5675288 -0.1234447 -0.1336977 0.0042673 -0.4728849 -0.9012216 0.1675944 -0.1403446 0.2425862 -0.5087358 0.1742775 -0.3778076 0.0977667 -0.6792003 1.1091934 -0.008368 0.1679194 0.2226637 0.5706866 0.0177 0.7068375 -0.0621053 0.7461803 -0.1063722 0.0840292 0.0241507 0.0148348 -0.058603 -0.0147819 0.0000486 -0.0857349 0.1003124 -0.1290327 0.0366535 0.0663745 0.0743839 0.0604618 0.0116385 0.0410734 0.0698501 -0.0231106 -0.020637 -0.0994971 0.0560585 -0.0152932 -0.092548 -0.0783616 0.022262 -0.0506179 0.0692165 0.8127715 0.1228834 0.0362584 -0.0223211 0.3574844 -0.0698319 -0.0659928 -0.0723417 0.3046728 0.0358517 0.0987692 0.0188037 0.0343505 0.019208 0.0761128 0.0516303 0.0517085 -0.0602815 0.6539478 -0.1303901 0.171971 -0.1321313 0.3872928 -0.0801693 0.0102673 -0.0111056 0.2366839 -0.0169329 -0.0541067 0.0253505 -0.0964106 -0.0908394 0.0955107 0.0605763 0.0862029 -0.0165014 0.0293465 0.0146978 -0.0000009 0.0040812 0.0177572 0.0787396 0.0061487 0.1348431 -0.0922343 0.0483754 -0.0899102 -0.0444488 -0.0696163 -0.0141064 -0.0687188 -0.0486291 -0.1083965 0.0064611 -0.0090254 -0.0711072 -0.0031862 -0.0699978 -0.1185043 -0.0197458 -0.0405469 -0.0615446 0.0735353 0.1024789 0.0121655 -0.0544526 0.0121041 0.0728951 0.014758 -0.0293417 0.0364189 -0.1160754 0.0757604 -0.0203951 -0.0101284 -0.0140684 0.0572369 0.0655003 0.0384475 0.0261902 -0.1161813 -0.1130454 0.1253123 -0.0084119 0.1133083 -0.0019143 0.0065442 -0.0363272 0.032795 0.0798714 -0.1085115 -0.001625 -0.0895664 0.0347362 0.0132254 0.0479831 -0.1161219 0.0304994 -0.13981 0.0871654 -0.0662622 -0.0464477 -0.0249178 -0.0686928 -0.0768243 -0.0045096 -0.0745921 0.0017596 -0.1932863 0.0163855 0.053453 -0.0102839 0.0871186 0.0011173 0.0288886 -0.0028223 0.0786836 0.0142642 -0.0163509 0.0116241 0.0596107 -0.1769685 0.1114997 -0.0002399 0.0625622 0.0295277 -0.1427453 -0.0128251 -0.1346857 -0.0610131 0.019775 -0.07974 -0.1048277 -0.0366476 -0.0468279 -0.1818659 0.0093982 0.0673779 0.0442108 0.0702897 -0.0062089 0.0787566 0.0121735 0.082006 0.1061606 0.0137413 0.0137156 -0.0332691 -0.1089561 -0.0881693 -0.0015475 -0.1190708 0.0142113 0.0481921 0.0267909 -0.1115251 -0.0009154 0.0739659 0.0046148 -0.0853473 0.0397012 -0.0600142 unknown
polarizability: 102.2649867|-0.9815214|84.1241265|0.3265402|-2.3568232|77.5775119 unknown
InChI: InChI=1S/C8H14O2/c1-7-3-5-8(10-7)4-2-6-9-8/h7H,2-6H2,1H3
charge 0 multiplicity 1
24 atoms
O  -0.526946 -0.489146 -0.862346
O  0.794777 0.034703 1.109159
C  0.351493 0.50299 -0.221732
C  -0.544628 1.732464 -0.009584
C  1.644518 0.597896 -1.044786
C  -1.899282 1.091556 0.380913
C  -1.943446 -0.226533 -0.445281
C  2.446411 -0.63541 -0.554991
C  2.053599 -0.742356 0.943552
C  -2.491872 -1.43663 0.318043
H  -0.62873 2.28956 -0.960707
H  -0.138543 2.400218 0.765996
H  2.16952 1.537144 -0.791088
H  1.435736 0.57901 -2.125473
H  -1.900492 0.856446 1.459853
H  -2.761369 1.744124 0.16188
H  -2.504915 -0.08065 -1.389839
H  2.112506 -1.531248 -1.104935
H  3.53442 -0.519654 -0.694127
H  1.873225 -1.785133 1.260076
H  2.806097 -0.28327 1.611936
H  -3.549376 -1.270245 0.599859
H  -2.438023 -2.348321 -0.302316
H  -1.899581 -1.600515 1.235037
