program: Gaussian 09
title: 000227179
version: EM64L-G09RevD.01
frameworkgroup: C1[X(C7H16O3)]
method: RPBEPBE
basis: SDD
operation: Freq
keyword: #pfreq=noraman
keyword: PBEPBE/SDD
title: #p freq=noraman PBEPBE/SDD
converged: YES YES NO NO
title: Mulliken charges:
elementType: O O O C C C C C C C H H H H H H H H H H H H H H H H
charge: -0.435476 -0.436686 -0.437684 -0.054732 -0.427008 -0.424730 -0.384032 -0.386481 -0.322762 -0.325612 0.213568 0.201385 0.195150 0.190734 0.204610 0.242137 0.186054 0.216588 0.216421 0.179764 0.213871 0.212241 0.180824 0.320189 0.330326 0.331344
chargesum: 0.00000
title: Mulliken charges with hydrogens summed into heavy atoms:
elementType: O O O C C C C C C C
charge: -0.115287 -0.106360 -0.106341 0.158836 -0.030473 -0.029386 0.044159 0.046527 0.070873 0.067453
polarizability: 1.08361272e+02 -1.81893389e-01 7.82695982e+01 -1.66994095e-01 -9.31786439e-01 7.61847208e+01
1716.lowfreq: -7.0775 -0.0011 -0.0009 -0.0008 10.3700 15.9123 34.6619 56.3890 60.1119
frequency: 34.6302 56.2839 60.0842 79.9729 89.3420 141.3321 153.0522 155.6065 233.6820 278.4093 296.7028 313.6116 320.7494 328.9768 422.8190 436.2273 523.8483 537.8916 753.4870 755.9833 811.7924 839.1307 896.6098 948.9220 957.8043 994.9549 1019.9847 1028.2732 1056.9765 1066.6963 1069.6585 1080.4690 1106.6164 1110.8598 1136.3613 1215.8809 1235.4369 1244.9670 1265.7250 1279.0285 1282.0845 1299.3112 1320.4904 1325.5347 1341.4991 1358.8026 1362.3059 1366.4862 1383.2154 1383.7799 1448.0739 1459.3705 1467.4285 1469.1970 1484.5048 1485.7421 2938.9760 2940.0291 2946.4476 2951.1437 2965.4535 2980.1430 3002.8967 3005.2604 3030.6173 3042.3137 3050.6847 3069.7422 3071.9797 3532.3740 3559.8129 3560.1250
redmass: 5.5945 2.7687 2.0025 3.9601 2.3492 2.6670 3.9976 2.2135 5.1456 2.8255 2.2360 1.2047 1.2278 1.2682 4.2571 2.2473 2.9700 3.3540 1.1274 1.2840 1.9197 1.2463 1.5802 4.5996 4.6111 3.2358 1.6818 5.3409 2.1809 1.7466 2.3188 1.9710 1.8961 1.3048 1.5258 1.3210 1.3793 1.3626 1.2162 1.1783 1.0925 1.2078 1.2625 1.2878 1.3075 1.2645 1.6320 1.3241 1.2651 1.2528 1.0847 1.0779 1.0797 1.0791 1.0921 1.0922 1.0690 1.0688 1.0626 1.0630 1.0660 1.0605 1.0961 1.0901 1.0922 1.0965 1.0916 1.0985 1.0993 1.0656 1.0661 1.0662
irintensity: 3.2960 6.6776 3.3739 0.5371 3.7308 7.8443 3.7617 1.9384 0.3157 0.3138 24.8710 276.6395 57.7921 138.5492 13.0198 8.2104 3.6611 24.2219 0.6262 6.6090 19.5694 3.0114 27.1723 73.1428 116.3710 2.5523 10.3690 7.7595 22.7816 45.6590 12.1183 4.2807 8.0954 46.7448 19.6583 46.6694 6.1400 11.5069 0.4440 8.0217 1.0672 8.5885 2.9077 2.9793 0.6437 10.1557 5.4342 17.9690 20.7017 40.6074 0.9504 3.3836 1.9419 2.8180 5.7575 14.3423 44.4623 60.5654 9.9182 65.0810 42.1550 29.3643 3.4533 23.0388 17.1551 48.0985 11.4386 45.8930 86.7882 3.8024 7.8776 5.7378
temp: 298.150 k
press: 1.00000 atm
elementType: 8 8 8 6 6 6 6 6 6 6 1 1 1 1 1 1 1 1 1 1 1 1 1 1 1 1
symmnumber: 1
zpe: 593495.3 jmol-1
zpe.correction: 0.226050 hartree
zpe.thermalcorrener: 0.239335 hartree
zpe.thermalcorrenthalpy: 0.240279 hartree
zpe.thermalcorrgfe: 0.185196 hartree
zpe.sumelectzpe: -501.126539 hartree
zpe.sumelectthermal: -501.113255 hartree
zpe.sumelectthermalent: -501.112311 hartree
zpe.sumelectthermalfe: -501.167394 hartree
dipole: 0.1195 -1.2343 0.5983
dipole: 1.3769
quadrupole: -93.5203 -64.1391 -56.7943
quadrupole: -8.1483 -11.6715 1.4537
quadrupole: -22.0358 7.3455 14.6903 -8.1483 -11.6715 1.4537
hfenergy: -501.3525899 hartree
pointgroup: C01 [X(C7H16O3)]
dipole: 0.047439 -0.5055222 0.1887831 debye
dipolederiv: -0.7803665 -0.0089868 0.017652 -0.0161359 -0.6397031 -0.248609 0.0183689 -0.2736102 -0.2191147 -0.94907 -0.0288765 0.1668515 -0.061814 -0.5912259 0.0068999 0.2073009 0.0158858 -0.1637323 -0.947024 0.1498766 0.0428056 0.2133421 -0.2828225 0.1962424 0.050683 0.1831518 -0.4773034 0.5192099 0.0090074 -0.000873 0.0128373 0.5117721 0.1811724 -0.0037682 0.1782798 0.3473507 -0.1927858 0.0693858 0.0043135 0.0585339 0.0156113 -0.0122443 -0.049772 0.0333139 0.1487961 -0.1949756 -0.0657314 0.010363 -0.0551786 0.0165557 -0.0049308 0.0643062 0.0357283 0.1495226 -0.2170858 0.0008365 0.0161338 0.1118926 -0.010385 0.0239884 -0.0462769 0.0178674 0.1516909 -0.2181346 0.0149031 0.0154601 -0.1249076 0.0399843 0.0417152 0.0380309 0.0732842 0.0940418 0.6798001 0.1122167 -0.1008472 0.0435736 0.4683554 -0.0110084 -0.0973873 -0.0210703 0.2988055 0.6790942 -0.1380512 0.0546693 -0.104955 0.3671178 -0.0800584 -0.0092031 -0.0733524 0.4021781 0.0559612 0.0005093 -0.0011053 -0.0009342 0.0008694 0.0421063 -0.0001168 0.0224307 -0.1413524 0.0575769 -0.0054783 0.0012998 -0.0353239 -0.1335739 -0.088324 -0.0019826 -0.1128471 0.0249468 0.0412202 0.0031715 0.022212 -0.0133299 0.0576056 0.0337205 0.0148092 0.0712467 -0.1751099 0.0440006 -0.0070589 -0.0206882 0.0094494 0.0583319 0.0262315 -0.0164059 0.064908 -0.1825708 0.0525624 0.0104422 -0.0034391 0.0392326 -0.1370917 -0.0839763 0.0014309 -0.1066622 0.0328298 0.0961671 -0.0044652 -0.0067462 -0.0167898 -0.0810605 -0.0581367 -0.0214163 -0.0728939 0.0405577 0.0324624 -0.0063036 -0.0034891 0.008142 0.0607794 0.0374824 0.0219389 0.0638044 -0.1872419 0.087598 0.0207738 0.0104258 0.0459295 -0.1158657 -0.0520613 0.0384841 -0.0817039 0.0443906 0.0483817 0.0019805 0.0132841 -0.007523 0.0676451 0.0256962 0.003648 0.0370836 -0.1562466 -0.0346501 -0.0522865 0.0087833 -0.0209112 -0.2207045 -0.0707264 0.0022043 -0.1272229 0.0132496 0.0374848 -0.0180159 0.0093839 -0.0093024 0.0581355 0.0251869 -0.0014959 0.066117 -0.1476797 0.0319932 0.0143163 -0.0108353 -0.0020797 -0.1371188 -0.0462944 -0.011813 -0.087319 0.0462953 -0.0301531 0.0350619 -0.0423214 0.0125247 0.0389982 0.0237571 -0.0216017 0.080775 -0.2469374 0.3970494 0.0021646 -0.015701 0.0082962 0.2215175 0.1688112 -0.0194114 0.0894471 0.0270369 0.3517155 -0.0296246 -0.1098232 -0.0625989 0.3283295 0.0390073 -0.0706102 0.0522748 -0.0079981 0.351968 -0.0797673 -0.0777686 -0.0319699 0.0379431 -0.1156477 -0.0899443 -0.1289168 0.2835949 unknown
polarizability: 108.3547567|-0.241862|78.4251095|-0.4630628|-0.7200585|76.0357249 unknown
InChI: InChI=1S/C7H16O3/c8-5-1-3-7(10)4-2-6-9/h7-10H,1-6H2
charge 0 multiplicity 1
26 atoms
O  -0.005716 1.519038 0.567713
O  5.07998 0.13835 -0.204939
O  -5.079133 0.092157 -0.252419
C  -0.003487 0.217332 -0.143403
C  1.287038 -0.575356 0.158367
C  -1.285159 -0.582853 0.178246
C  2.572804 0.177636 -0.249693
C  -2.573718 0.146883 -0.260937
C  3.848111 -0.597161 0.125393
C  -3.849471 -0.568135 0.216447
H  -0.012651 0.522354 -1.207138
H  1.23727 -1.549758 -0.36997
H  1.31908 -0.811585 1.244639
H  -1.314693 -0.785196 1.271613
H  -1.228548 -1.571794 -0.320567
H  2.591786 1.171248 0.23408
H  2.557418 0.356478 -1.34624
H  -2.549017 1.182108 0.13623
H  -2.603892 0.227106 -1.365046
H  3.847648 -1.59997 -0.357179
H  3.906982 -0.742505 1.218101
H  -3.913137 -1.586125 -0.205577
H  -3.84719 -0.653291 1.326182
H  0.042507 1.335197 1.542072
H  5.080992 0.337795 -1.175324
H  -5.071306 1.032846 0.058549
