program: Gaussian 09
title: 000021405
version: EM64L-G09RevD.01
frameworkgroup: C1[X(C6H15N)]
method: RPBEPBE
basis: SDD
operation: Freq
keyword: #pfreq=noraman
keyword: PBEPBE/SDD
title: #p freq=noraman PBEPBE/SDD
converged: YES YES NO NO
title: Mulliken charges:
elementType: N C C C C C C H H H H H H H H H H H H H H H
charge: -0.554521 -0.365155 -0.105638 -0.363033 -0.353847 -0.708830 -0.696585 0.172191 0.221220 0.204135 0.197856 0.184389 0.194454 0.197488 0.202162 0.221346 0.207101 0.215463 0.209935 0.208566 0.251640 0.259663
chargesum: 0.00000
title: Mulliken charges with hydrogens summed into heavy atoms:
elementType: N C C C C C C
charge: -0.043219 0.028256 0.098497 0.019213 0.038095 -0.078221 -0.062621
polarizability: 8.74577715e+01 -1.10225252e+00 6.85995524e+01 -3.26927712e-01 -1.33848400e+00 6.37906293e+01
1716.lowfreq: -27.4826 -0.0005 -0.0004 0.0005 15.4990 23.8583 67.1837 78.5602 124.4004
frequency: 67.0446 78.4234 124.3887 143.8531 229.8328 236.2959 247.2135 293.1419 315.3958 417.0427 425.1178 488.4620 659.8367 730.4094 780.6357 823.0867 892.5644 901.8753 946.3912 985.5319 1017.7859 1042.0170 1078.0394 1083.8818 1138.3120 1157.8997 1194.8456 1232.0286 1265.2038 1283.4846 1291.1092 1322.2553 1329.0307 1353.1860 1367.3886 1380.9416 1389.9525 1456.9765 1467.0172 1470.0928 1476.6434 1477.6656 1478.4112 1487.3799 1634.8294 2944.3732 2956.4395 2961.1155 2968.1511 2971.1566 2978.6906 2997.6756 3019.1580 3040.7235 3060.1778 3062.6986 3067.7967 3070.6424 3415.4598 3541.3658
redmass: 1.7600 2.4542 2.8280 1.8930 1.0924 1.1192 1.1582 2.4752 2.8545 2.0497 2.3148 2.4700 1.4633 1.0839 1.3111 2.1035 1.7612 1.2510 1.7070 1.2224 1.9328 2.3886 2.3521 1.8052 2.1390 2.2189 1.6951 1.4053 1.3031 1.2490 1.0666 1.3573 1.3090 1.5515 1.4836 1.2243 1.2204 1.0698 1.0726 1.0627 1.0608 1.0426 1.0599 1.0845 1.0925 1.0655 1.0589 1.0365 1.0596 1.0370 1.0820 1.0966 1.0994 1.1014 1.0994 1.0990 1.1007 1.0992 1.0444 1.0960
irintensity: 0.3510 0.4764 0.2685 0.3084 7.2467 45.6870 0.6413 1.3033 13.4047 15.7590 0.9653 3.3737 223.1092 11.3747 0.2722 3.0419 5.4373 3.7870 0.2780 2.3439 5.0367 3.1766 4.0393 7.0855 6.6723 21.2908 0.3709 4.4162 4.7747 0.4465 0.3988 6.3959 2.2690 2.9109 9.4291 18.2201 13.5960 0.9292 0.4294 2.4507 6.1462 11.7170 9.4059 17.2881 36.2184 12.2662 6.4441 24.6585 72.0745 32.5491 52.6849 0.2052 3.8622 64.8541 58.1792 54.7339 105.0009 53.0699 5.0027 0.4689
temp: 298.150 k
press: 1.00000 atm
elementType: 7 6 6 6 6 6 6 1 1 1 1 1 1 1 1 1 1 1 1 1 1 1
symmnumber: 1
zpe: 530654.7 jmol-1
zpe.correction: 0.202116 hartree
zpe.thermalcorrener: 0.211926 hartree
zpe.thermalcorrenthalpy: 0.212870 hartree
zpe.thermalcorrgfe: 0.167614 hartree
zpe.sumelectzpe: -291.768700 hartree
zpe.sumelectthermal: -291.758890 hartree
zpe.sumelectthermalent: -291.757946 hartree
zpe.sumelectthermalfe: -291.803201 hartree
dipole: 0.4133 1.0432 0.6166
dipole: 1.2804
quadrupole: -43.5061 -50.3674 -45.3614
quadrupole: 2.6615 1.5022 -1.7446
quadrupole: 2.9055 -3.9558 1.0503 2.6615 1.5022 -1.7446
hfenergy: -291.9708153 hartree
pointgroup: C01 [X(C6H15N1)]
dipole: 0.1578515 -0.4205791 -0.2279482 debye
dipolederiv: -0.5040905 -0.1469378 0.0611929 -0.1722626 -0.8088988 -0.1227426 -0.0044101 -0.1623112 -0.2264485 -0.0830303 -0.0026109 -0.0057723 0.0450666 0.040461 0.0301548 -0.0426388 0.0156088 0.1700006 0.4561576 0.1675894 -0.0631165 0.0580534 0.502529 0.0520437 -0.0617787 0.0142101 0.2495475 -0.0479234 -0.0051365 -0.0074184 0.0072544 0.088386 0.049316 -0.0381463 0.0449783 0.1563195 0.0493551 -0.0053325 0.0001787 -0.0377108 0.1179167 0.0281525 0.0259719 0.0289926 0.1603771 -0.0183284 0.0416282 0.0261744 -0.0063363 -0.2206651 -0.0610321 -0.0090795 -0.0753627 0.0641034 -0.076942 -0.044428 0.0196073 -0.0183761 0.0580992 0.0185574 0.0047082 0.0190684 0.0865712 0.0235551 -0.0121606 0.0281433 -0.0123822 0.0628027 0.0052361 0.0259286 0.0463177 -0.2033009 0.055383 0.0434187 0.0117328 0.0368089 -0.1516405 -0.0575742 0.0192429 -0.0685165 0.048793 0.0206318 -0.0205464 0.0269319 -0.0115408 -0.0037681 0.0030247 0.0206577 0.0125457 -0.2014684 0.0526418 -0.0008426 -0.0011205 0.0057009 -0.1686744 -0.0710636 0.0088211 -0.0910046 0.0252318 0.0386447 0.0003658 -0.0076669 -0.0021068 0.0525208 0.0399781 0.0036835 0.0617267 -0.1901167 0.0268472 -0.0119462 0.0360747 -0.0014222 0.0571803 0.0428281 0.0008454 0.0707551 -0.1964837 0.0245823 -0.0256169 -0.0078844 0.0116899 -0.1698666 -0.0793098 0.0015067 -0.1068322 0.0348215 0.0922889 0.0010116 -0.0121094 -0.0033239 0.0605469 0.043112 0.0170246 -0.0308828 -0.1782814 -0.0357968 -0.1645375 0.0577912 -0.1560801 -0.0611416 0.030206 0.0625212 0.0411853 0.0556528 -0.1642244 0.1216632 -0.0707956 0.0798071 0.0357042 0.0103829 -0.0844152 0.0273706 0.054883 -0.18195 0.083377 -0.0516654 0.1145352 0.0306976 0.040592 -0.0703492 0.0400927 0.0756723 0.0796546 -0.0115708 -0.0155579 -0.0308859 0.0741844 0.0331982 0.0495442 0.0502642 -0.1830837 0.0800986 0.0181747 0.0223573 -0.0470398 -0.145234 -0.0944961 0.0036896 -0.1100367 0.0349912 0.1667967 -0.0524553 -0.0057261 -0.0168416 0.3091948 -0.0595396 0.0445691 0.0589139 -0.0421349 -0.0543516 0.0268934 -0.041351 0.1573929 0.2396656 0.1189757 0.0221031 0.1129166 0.2043533 unknown
polarizability: 87.4718386|1.0000464|68.4748754|0.00341|-1.5381556|63.9012392 unknown
InChI: InChI=1S/C6H15N/c1-3-4-5-6(2)7/h6H,3-5,7H2,1-2H3
charge 0 multiplicity 1
22 atoms
N  2.764601 0.908711 -0.012634
C  0.33958 0.559027 -0.212496
C  1.666207 -0.040196 0.313152
C  -0.932302 -0.22342 0.182723
C  -2.232514 0.496143 -0.245096
C  1.918502 -1.479295 -0.213874
C  -3.507443 -0.286159 0.137151
H  0.393855 0.632917 -1.321523
H  0.272747 1.596226 0.169953
H  1.601683 -0.082065 1.420077
H  -0.917723 -1.235509 -0.270059
H  -0.945689 -0.372863 1.283187
H  -2.212656 0.6612 -1.342041
H  -2.259616 1.503017 0.218821
H  1.937868 -1.486964 -1.321653
H  1.135806 -2.186255 0.119486
H  2.892227 -1.861285 0.147417
H  -4.422208 0.247964 -0.179517
H  -3.56594 -0.437298 1.231775
H  -3.516974 -1.28499 -0.339087
H  2.841998 1.084221 -1.02315
H  3.672489 0.62507 0.376088
