program: Gaussian 09
title: 000227170
version: EM64L-G09RevD.01
frameworkgroup: C1[X(C16H31NO4)]
method: RPBEPBE
basis: SDD
operation: Freq
keyword: #p
keyword: freq=noraman
keyword: PBEPBE/SDD
title: #p freq=noraman PBEPBE/SDD
converged: YES YES NO NO
title: Mulliken charges:
elementType: O O O O N C C C C C C C C C C C C C C C C H H H H H H H H H H H H H H H H H H H H H H H H H H H H H H H
charge: -0.419168 -0.417763 -0.223070 -0.226726 -0.112046 -0.389323 -0.384514 -0.373355 -0.384886 -0.348830 -0.381751 -0.429372 -0.372804 -0.368890 -0.353207 -0.356797 -0.425001 -0.421392 -0.697100 0.184140 0.186486 0.196664 0.196349 0.191301 0.191410 0.184704 0.185619 0.193520 0.193485 0.204022 0.222799 0.191093 0.190916 0.191005 0.206926 0.189479 0.189315 0.233194 0.187507 0.187271 0.187029 0.194747 0.194843 0.224521 0.292393 0.229329 0.269880 0.209475 0.209396 0.214527 0.380000 0.382648
chargesum: 0.00000
title: Mulliken charges with hydrogens summed into heavy atoms:
elementType: O O O O N C C C C C C C C C C C C C C C C
charge: -0.039169 -0.035115 -0.223070 -0.226726 -0.112046 0.003691 -0.001802 -0.003033 0.002119 0.077991 0.000258 -0.031442 0.005990 0.051811 0.021093 0.032793 0.091913 0.077817 -0.063702 0.184140 0.186486
polarizability: 2.31358882e+02 -1.03656482e+00 1.81563761e+02 -1.76825481e+00 5.68547827e+00 1.71730195e+02
1716.lowfreq: -9.6014 -3.3896 -0.0012 -0.0006 -0.0003 5.3804 8.3443 17.2250 23.2991
frequency: 7.7993 17.0558 23.2861 33.3736 36.4329 42.8503 44.8049 53.2716 58.9499 67.4827 79.6056 93.1513 100.5910 112.6632 132.4417 142.0620 154.4351 158.3446 170.2848 190.7527 211.0505 228.9835 242.9320 272.5110 287.9592 290.0682 328.7944 364.8695 374.0015 412.1830 458.8953 475.6120 485.3081 492.3318 499.3837 546.6033 594.5993 618.9148 632.1048 642.0422 718.1530 719.7055 724.3705 736.7776 759.9444 786.6290 815.3712 848.2911 850.3669 871.1094 886.6099 887.6527 926.1535 959.0430 976.8727 981.5047 986.0115 989.9127 1014.5714 1023.7198 1025.8637 1035.8517 1046.2830 1054.5222 1065.2260 1079.5641 1080.5991 1082.0646 1090.9290 1113.7656 1123.8311 1149.2237 1179.9549 1191.0260 1202.3572 1212.4393 1229.7841 1235.4349 1242.3712 1251.3478 1256.0312 1258.7568 1266.9310 1274.8256 1277.7315 1282.6660 1285.0113 1286.2297 1291.9160 1293.6926 1296.5403 1303.9426 1322.6517 1340.8820 1352.6217 1354.2695 1356.4390 1361.2367 1380.9256 1382.1199 1389.1355 1390.3610 1431.6982 1440.9280 1459.4058 1459.4431 1462.6829 1462.9160 1464.2931 1466.5414 1468.8306 1473.4155 1476.4979 1478.6669 1483.5255 1487.3326 1489.1066 1676.4744 1681.9832 2829.0261 2847.8830 2860.1346 2942.7800 2947.4420 2948.5230 2950.0872 2952.5642 2957.2743 2957.7896 2962.8705 2967.6034 2970.9382 2980.2161 2981.8864 2984.2095 2987.4105 2994.5013 3001.0125 3006.6958 3019.2290 3030.7164 3040.1044 3049.6722 3050.7317 3060.7456 3063.8307 3067.6063 3069.1933 3516.3660 3522.4782
redmass: 5.3531 5.5427 4.4698 5.9655 3.5537 1.9916 9.7302 3.9319 4.9222 1.6453 3.1488 3.3053 1.9278 2.2426 2.1016 2.0499 3.2732 2.1248 3.5233 3.5914 3.7009 1.1183 2.6237 3.1001 3.3307 4.3724 3.0703 3.4776 3.2778 3.2504 3.0392 3.2613 2.4946 2.2789 2.0385 2.9840 3.4206 1.9476 1.5614 2.4253 1.0612 1.0700 1.0940 1.1515 1.3049 1.7134 1.6681 2.4246 1.6963 3.5629 1.6305 1.7718 1.4267 2.2679 1.6380 2.0663 3.5962 3.0853 2.3062 1.3950 3.6101 1.9100 2.4105 2.7409 2.5213 2.3018 2.1263 2.2410 2.4107 1.8688 2.8853 2.2032 1.9285 1.6511 1.3784 1.4780 1.3368 1.3324 1.3869 1.3979 1.3154 1.4098 1.5137 1.2446 1.0588 1.1564 1.2496 1.3153 1.1489 1.1481 1.2055 1.3303 1.3538 1.4442 1.6237 1.6386 1.6546 1.6444 1.5568 1.3696 1.2181 1.5644 1.0931 1.1080 1.0746 1.0739 1.0690 1.0738 1.0828 1.0817 1.0849 1.0845 1.0433 1.0851 1.0893 1.0931 1.0959 8.4190 8.3896 1.0714 1.0717 1.0700 1.0590 1.0587 1.0589 1.0593 1.0595 1.0614 1.0598 1.0588 1.0585 1.0367 1.0927 1.0879 1.0788 1.0946 1.1006 1.0968 1.1034 1.1046 1.1048 1.1045 1.0871 1.0995 1.0843 1.0890 1.1006 1.0993 1.0641 1.0641
irintensity: 0.1858 0.6994 0.0523 0.6033 0.0475 0.0652 0.5625 0.0748 0.2927 0.0329 0.3854 0.0965 0.1618 0.1058 0.0573 0.0806 1.1749 0.0558 0.4513 5.4474 1.4473 0.0028 3.0963 0.8019 6.2248 0.9324 3.4369 0.7267 0.7212 1.4751 14.8497 4.8441 15.9893 19.1574 44.2490 18.5857 29.2628 61.3762 155.8772 57.1590 16.2736 3.0552 2.9817 1.2606 3.0299 8.2133 4.3037 2.2903 1.6470 0.7739 0.3960 7.6158 6.5160 51.9362 19.5987 17.4676 0.5290 16.0697 145.5713 184.5117 28.0665 172.0025 135.3071 9.8400 11.0544 1.8535 0.3475 0.2946 5.4212 2.4328 11.0737 43.3176 1.9072 15.5995 16.1492 3.9304 2.7980 2.3612 16.0034 6.7326 5.3326 4.8234 0.4298 1.5380 0.0418 0.6725 2.5548 4.8072 2.6045 0.4126 5.3966 2.3470 0.5780 0.0749 0.7506 0.1855 0.4278 1.1278 20.4424 8.0438 11.2060 17.2844 26.5634 15.4822 0.0295 0.2529 0.7665 0.3992 3.8411 2.1200 2.9581 1.6152 12.0819 3.0849 2.0810 3.7412 43.8120 204.2508 230.9561 68.8294 69.3741 156.0511 7.7821 1.9923 0.1603 1.7322 0.7397 32.7100 5.1081 90.6602 184.4967 37.4164 9.4736 15.0844 26.3751 6.9654 1.7377 21.4641 0.2993 3.5342 0.1360 171.4910 9.9071 114.9152 2.3709 49.5662 99.8421 56.2384 28.4220 28.9019
temp: 298.150 k
press: 1.00000 atm
elementType: 8 8 8 8 7 6 6 6 6 6 6 6 6 6 6 6 6 6 6 6 6 1 1 1 1 1 1 1 1 1 1 1 1 1 1 1 1 1 1 1 1 1 1 1 1 1 1 1 1 1 1 1
symmnumber: 1
zpe: 1185643.9 jmol-1
zpe.correction: 0.451588 hartree
zpe.thermalcorrener: 0.478040 hartree
zpe.thermalcorrenthalpy: 0.478984 hartree
zpe.thermalcorrgfe: 0.388123 hartree
zpe.sumelectzpe: -982.225366 hartree
zpe.sumelectthermal: -982.198915 hartree
zpe.sumelectthermalent: -982.197970 hartree
zpe.sumelectthermalfe: -982.288832 hartree
dipole: 1.8833 1.0502 1.4942
dipole: 2.6234
quadrupole: -121.5699 -120.0099 -131.2661
quadrupole: 2.1644 5.2660 -1.9334
quadrupole: 2.7121 4.2721 -6.9842 2.1644 5.2660 -1.9334
hfenergy: -982.6769542 hartree
pointgroup: C01 [X(C16H31N1O4)]
dipole: 0.7492631 0.3861603 0.5956497 debye
polarizability: 231.3002532|-1.8531959|181.3394457|-1.8344399|5.9465281|172.013138 unknown
InChI: InChI=1S/C16H31NO4/c1-2-3-4-5-6-7-8-9-10-11-12-17(13-15(18)19)14-16(20)21/h18,20H,2-14H2,1H3
charge 0 multiplicity 1
52 atoms
O  5.732769 -2.786618 -1.533733
O  4.5520 3.527568 -0.52843
O  3.52597 -2.640717 -0.825219
O  4.484622 1.702925 -1.962909
N  4.119607 -0.042742 0.371609
C  -1.374426 -0.346981 0.522525
C  -2.78228 0.061158 1.011626
C  -0.258411 -0.055228 1.551088
C  -3.897087 -0.230295 -0.018201
C  1.143084 -0.481833 1.061797
C  -5.306612 0.169085 0.473603
C  2.253321 -0.183793 2.092366
C  -6.420966 -0.120249 -0.55754
C  3.653328 -0.659765 1.645703
C  -7.830999 0.276858 -0.06521
C  -8.944731 -0.010452 -1.098173
C  5.16105 -0.813097 -0.320192
C  4.450453 1.378775 0.516149
C  -10.349659 0.390915 -0.598659
C  4.665453 -2.138841 -0.885004
C  4.485124 2.150943 -0.798373
H  -1.145529 0.184123 -0.424857
H  -1.37067 -1.429579 0.277766
H  -2.785667 1.143917 1.258164
H  -3.010158 -0.47286 1.958237
H  -0.49423 -0.578032 2.50262
H  -0.255136 1.030494 1.787216
H  -3.889614 -1.31182 -0.268891
H  -3.67217 0.307866 -0.962904
H  1.146288 -1.566021 0.830674
H  1.387596 0.026051 0.109338
H  -5.531929 -0.371137 1.417178
H  -5.313671 1.250258 0.726424
H  2.260242 0.900805 2.330155
H  2.02222 -0.69617 3.049443
H  -6.412814 -1.201068 -0.811655
H  -6.19628 0.421241 -1.500519
H  3.601378 -1.748808 1.47617
H  4.391623 -0.484803 2.470414
H  -8.057975 -0.265964 0.876483
H  -7.840087 1.357394 0.190236
H  -8.716447 0.530957 -2.039123
H  -8.935559 -1.090312 -1.351833
H  6.053322 -1.041437 0.317273
H  5.527246 -0.233612 -1.185981
H  5.433185 1.567462 1.024772
H  3.69128 1.865109 1.15158
H  -10.614049 -0.159759 0.324014
H  -10.393477 1.471981 -0.36664
H  -11.127111 0.175713 -1.354923
H  5.405015 -3.642888 -1.921042
H  4.602568 4.02878 -1.387214
