program: Gaussian 09
title: 000227166
version: EM64L-G09RevD.01
frameworkgroup: C1[X(C12H20N2O8)]
method: RPBEPBE
basis: SDD
operation: Freq
keyword: #p
keyword: freq=noraman
keyword: PBEPBE/SDD
title: #p freq=noraman PBEPBE/SDD
converged: YES YES NO NO
title: Mulliken charges:
elementType: O O O O O O O O N N C C C C C C C C C C C C H H H H H H H H H H H H H H H H H H H H
charge: -0.419933 -0.419829 -0.395397 -0.419545 -0.299933 -0.248930 -0.298635 -0.215378 -0.087536 -0.116465 -0.346259 -0.393033 -0.389940 -0.363282 -0.442076 -0.442628 -0.432952 -0.423489 0.237670 0.249920 0.239992 0.186055 0.190939 0.254554 0.190299 0.257159 0.193403 0.208512 0.193741 0.215701 0.243321 0.238729 0.226179 0.227126 0.314087 0.232845 0.266024 0.234201 0.410973 0.373387 0.387966 0.382457
chargesum: 0.00000
title: Mulliken charges with hydrogens summed into heavy atoms:
elementType: O O O O O O O O N N C C C C C C C C C C C C
charge: -0.008960 -0.046442 -0.007431 -0.037088 -0.299933 -0.248930 -0.298635 -0.215378 -0.087536 -0.116465 0.099234 0.054425 0.011975 0.046160 0.039974 0.010677 0.113981 0.076735 0.237670 0.249920 0.239992 0.186055
polarizability: 1.79514430e+02 3.52824070e+00 1.72992340e+02 8.17080646e-01 -7.90335388e+00 1.49919013e+02
1716.lowfreq: -13.4336 -8.9950 -6.9108 0.0005 0.0006 0.0008 19.8736 25.0305 37.7381
frequency: 19.1871 24.4867 37.6698 39.0558 49.6732 57.3326 61.9826 63.5649 87.8117 101.4927 118.1603 136.1048 139.8455 164.6792 168.5194 179.5242 191.4674 225.7662 238.8808 277.2262 301.1620 314.4631 328.0707 334.7016 344.1078 395.2404 401.9333 446.2632 449.6195 464.9382 498.3291 503.0994 523.9457 538.8446 558.4167 588.1240 599.2440 624.3263 642.1212 648.9459 667.3120 694.2784 742.3643 786.6237 792.3441 829.2451 842.5770 845.8774 869.4231 883.5865 906.6629 915.8437 934.6374 956.2042 968.6350 978.1495 1000.3606 1027.4416 1043.6707 1066.8845 1074.8519 1083.8666 1089.5743 1131.8609 1142.1437 1149.3907 1174.7196 1177.5382 1215.6531 1233.9923 1240.5236 1256.9161 1264.3841 1267.9895 1282.1894 1297.5054 1300.7851 1318.2029 1322.6210 1338.0065 1351.8592 1367.6613 1373.3611 1376.0610 1377.9362 1381.0759 1389.0852 1408.7386 1426.6705 1430.2991 1435.3238 1440.6403 1457.1520 1460.9202 1471.0430 1473.5505 1623.0311 1639.4461 1659.8529 1684.3630 2859.3477 2875.1444 2889.4985 2902.8302 2974.2411 2976.7910 2979.6255 2984.0292 3021.6544 3022.6244 3036.9586 3040.5716 3044.0961 3051.8975 3057.0217 3064.2443 3067.8082 3510.0945 3517.5401 3521.3149
redmass: 7.1019 6.8768 5.5966 7.7585 7.1161 6.0185 6.3595 6.0762 6.2754 6.0351 8.3781 8.0759 2.8696 8.2138 4.7898 5.8676 3.2704 2.6881 3.0781 3.1921 3.9616 3.8419 3.8993 3.2383 2.5524 3.2214 2.3629 2.6316 2.3528 2.7191 1.9944 2.9004 2.6714 4.0386 2.6091 1.5460 3.7121 1.7053 3.0026 4.0730 1.4769 3.9143 1.6784 2.6559 2.9055 6.0156 3.1389 5.3559 3.5316 2.8886 1.5831 1.2287 2.0736 2.4866 2.4319 2.2255 2.3199 2.5279 2.2336 2.9026 2.1515 2.4779 2.2158 2.4261 2.1991 2.0725 1.9782 1.7525 1.4330 1.1955 1.3470 1.4775 1.3625 1.5910 1.7084 1.2815 1.5856 1.3921 1.3607 1.2836 1.5439 1.4422 1.4207 1.5792 1.4389 1.5470 1.5122 1.5918 1.0965 1.0948 1.0857 1.1328 1.0953 1.0820 1.0918 1.0942 5.8891 7.9819 8.2399 8.5514 1.0707 1.0716 1.0689 1.0691 1.0591 1.0623 1.0659 1.0663 1.0913 1.0862 1.0850 1.0928 1.0999 1.0901 1.0724 1.0986 1.0955 1.0639 1.0639 1.0642
irintensity: 1.1405 1.6242 1.1662 0.9052 1.0239 0.1331 1.8399 1.3358 0.4294 2.0635 3.2063 0.1957 2.3371 8.3783 4.6569 10.0384 4.1796 0.8638 0.7040 7.5218 2.1780 4.4241 4.6042 1.4893 6.8678 21.3971 9.4786 6.1630 5.9117 12.6161 28.7978 25.8941 66.6611 22.6789 25.7766 123.6911 36.0070 86.3199 46.5004 18.3970 123.1573 52.4569 5.9537 12.2033 25.6327 11.2928 4.1063 9.3523 9.4991 4.6411 48.1083 131.9118 36.3784 13.5289 37.5620 38.1575 9.8128 225.4516 293.0865 158.7136 55.5557 238.8571 23.6422 26.4491 165.4275 27.3419 40.1410 22.6217 4.0835 16.6801 13.1576 10.3363 2.1327 13.1539 3.5180 2.5570 26.6558 5.9504 7.8217 9.5591 13.8459 4.7332 7.2139 35.9335 5.9495 9.9237 27.9975 43.8403 28.1960 12.5089 20.8406 35.8544 15.9679 5.5348 11.7196 29.8590 74.4833 285.5726 248.6151 217.9734 59.7644 76.3685 111.8917 91.1540 34.2237 65.3543 39.9408 35.2267 12.6782 9.6594 4.3737 10.6077 10.4747 120.7739 659.2597 23.9126 53.5883 43.2839 18.2061 31.8239
temp: 298.150 k
press: 1.00000 atm
elementType: 8 8 8 8 8 8 8 8 7 7 6 6 6 6 6 6 6 6 6 6 6 6 1 1 1 1 1 1 1 1 1 1 1 1 1 1 1 1 1 1 1 1
symmnumber: 1
zpe: 865070.9 jmol-1
zpe.correction: 0.329488 hartree
zpe.thermalcorrener: 0.353314 hartree
zpe.thermalcorrenthalpy: 0.354258 hartree
zpe.thermalcorrgfe: 0.273321 hartree
zpe.sumelectzpe: -1178.832853 hartree
zpe.sumelectthermal: -1178.809027 hartree
zpe.sumelectthermalent: -1178.808083 hartree
zpe.sumelectthermalfe: -1178.889020 hartree
dipole: 2.1108 0.8934 -0.5491
dipole: 2.3569
quadrupole: -117.0680 -114.5295 -135.4743
quadrupole: 2.5481 -4.9901 1.8759
quadrupole: 5.2893 7.8278 -13.1171 2.5481 -4.9901 1.8759
hfenergy: -1179.1623412 hartree
pointgroup: C01 [X(C12H20N2O8)]
dipole: 0.8225636 -0.2413729 0.353534 debye
polarizability: 178.6323223|-5.8655775|158.5646607|-0.387963|-13.3552118|165.2288004 unknown
InChI: InChI=1S/C12H20N2O8/c15-9(16)5-13(6-10(17)18)3-1-2-4-14(7-11(19)20)8-12(21)22/h15,17,19,21H,1-8H2
charge 0 multiplicity 1
42 atoms
O  -0.23276 -1.796989 -1.587078
O  -4.237845 -0.704305 1.211629
O  1.588511 -2.977883 2.548202
O  5.171795 0.248057 -1.114398
O  -1.311263 -1.282454 0.40272
O  -2.962167 1.085168 1.973657
O  1.456812 -2.740589 0.263774
O  3.140143 1.142435 -1.800295
N  -2.573515 0.884613 -1.213908
N  1.912576 0.151717 0.658899
C  -0.184708 1.834273 -1.042664
C  0.030994 1.859232 0.485435
C  -1.656217 2.006292 -1.499427
C  1.497528 1.574324 0.876695
C  -2.235883 -0.430913 -1.734445
C  -3.767695 1.048055 -0.391808
C  1.440831 -0.725773 1.74324
C  3.353129 -0.013252 0.408582
C  -1.235808 -1.20982 -0.853612
C  -3.595116 0.529676 1.048526
C  1.499233 -2.203347 1.400579
C  3.805213 0.532008 -0.942125
H  0.402012 2.653442 -1.507951
H  0.240318 0.903086 -1.461635
H  -0.236609 2.859861 0.882997
H  -0.656044 1.148589 0.978821
H  -2.083042 2.91123 -1.026535
H  -1.644713 2.18849 -2.599411
H  1.669366 1.867248 1.942195
H  2.153739 2.207628 0.254415
H  -1.79814 -0.348204 -2.747105
H  -3.154268 -1.046884 -1.810072
H  -4.629856 0.517179 -0.84121
H  -4.016077 2.122097 -0.325618
H  0.368747 -0.516686 1.925154
H  1.975912 -0.578079 2.712664
H  3.612331 -1.088053 0.405001
H  4.00544 0.45879 1.186985
H  0.483412 -2.191844 -0.977027
H  -3.993402 -1.088914 2.09648
H  1.533589 -3.942967 2.306865
H  5.469397 0.597065 -1.997791
