program: Gaussian 09
title: 000227164
version: EM64L-G09RevD.01
frameworkgroup: C1[X(C8H16N2O4)]
method: RPBEPBE
basis: SDD
operation: Freq
keyword: #p
keyword: freq=noraman
keyword: PBEPBE/SDD
title: #p freq=noraman PBEPBE/SDD
converged: YES YES NO NO
title: Mulliken charges:
elementType: O O O O N N C C C C C C C C H H H H H H H H H H H H H H H H
charge: -0.421767 -0.421924 -0.223969 -0.223494 -0.085947 -0.085588 -0.349731 -0.351796 -0.412903 -0.413609 -0.642847 -0.642901 0.182557 0.182090 0.223707 0.190300 0.191412 0.223295 0.260937 0.221802 0.260942 0.221713 0.223211 0.270663 0.184706 0.223095 0.270215 0.185234 0.380312 0.380283
chargesum: 0.00000
title: Mulliken charges with hydrogens summed into heavy atoms:
elementType: O O O O N N C C C C C C C C
charge: -0.041454 -0.041641 -0.223969 -0.223494 -0.085947 -0.085588 0.064275 0.062911 0.069836 0.069045 0.035734 0.035642 0.182557 0.182090
polarizability: 1.43824125e+02 -3.08247951e-02 9.55060514e+01 -1.99841443e-01 -3.74155213e-01 1.03876377e+02
1716.lowfreq: -19.6863 -4.8781 0.0002 0.0006 0.0010 2.4045 15.0279 25.6385 31.9163
frequency: 14.5791 25.5737 30.0549 42.5581 45.6268 103.7021 115.8758 131.2830 169.2470 203.0710 208.1547 213.0442 221.6777 317.7539 327.2190 341.4206 352.3146 375.4108 397.8040 472.7932 494.5655 496.2485 525.4480 601.2505 622.4668 631.9712 640.6673 783.4590 818.5813 836.6217 868.9823 872.6095 972.8337 973.2657 1017.4285 1019.7945 1038.0082 1056.4017 1064.2328 1073.2754 1110.8331 1118.9787 1149.9222 1171.1319 1176.0858 1230.0091 1250.6260 1251.4161 1280.2319 1287.5310 1296.4912 1301.8291 1325.8986 1354.8844 1377.8272 1396.6237 1426.9282 1427.2172 1436.2533 1440.9788 1466.3303 1469.8259 1470.8340 1474.0774 1491.9434 1492.6089 1682.8185 1683.2370 2837.4407 2838.8028 2858.9676 2860.7070 2879.5831 2882.1632 3034.3357 3038.6716 3041.3703 3050.3685 3051.1202 3055.5136 3106.4931 3107.3005 3520.1873 3520.4830
redmass: 4.5726 6.0037 4.9362 4.9418 6.5002 2.6130 2.4787 2.5793 4.5433 1.2384 1.2635 2.8445 3.3783 3.1506 2.2489 2.8759 3.5387 2.5670 3.7007 3.4974 1.9207 1.9504 3.5922 3.6168 1.8337 1.5473 2.5714 1.2065 5.1162 4.7964 4.2452 4.2104 2.1380 2.1212 2.7353 2.9213 1.6914 2.1209 1.9116 2.6862 1.2863 1.4418 2.1979 1.9685 1.4726 1.8595 1.5175 1.5292 1.6427 1.7026 1.8795 1.1616 1.5770 1.5946 1.5440 1.3941 1.1136 1.1141 1.1319 1.1443 1.1070 1.0568 1.0642 1.0883 1.0499 1.0451 8.5145 8.5280 1.0704 1.0704 1.0583 1.0582 1.0694 1.0683 1.0867 1.0851 1.0841 1.0724 1.0727 1.0929 1.1009 1.1008 1.0641 1.0641
irintensity: 2.4542 0.0994 1.2758 0.1222 0.0389 0.5043 1.7421 0.9254 1.1984 0.4144 2.5515 0.0427 1.2449 3.9819 5.2136 18.0380 5.4771 3.7251 12.1681 8.3289 45.5791 24.1463 8.2762 16.1371 149.6453 86.7783 59.2687 5.5536 32.1188 6.7303 2.7133 5.7590 4.2905 5.9615 637.6611 190.2391 27.3138 21.2492 17.4990 0.0077 1.7630 3.6511 1.4759 38.3206 0.9825 4.9170 11.2401 27.9057 2.2010 22.9030 20.1322 0.1575 1.6930 3.2817 15.3988 3.9542 30.6464 23.9272 4.5902 4.4932 0.0451 0.1238 18.7923 6.7233 44.4155 10.0673 123.8858 278.7115 121.8757 45.0605 61.4069 125.1525 154.5456 88.9260 4.7065 9.1702 6.9732 19.8140 36.2673 57.0317 26.3461 6.9926 25.7925 24.1077
temp: 298.150 k
press: 1.00000 atm
elementType: 8 8 8 8 7 7 6 6 6 6 6 6 6 6 1 1 1 1 1 1 1 1 1 1 1 1 1 1 1 1
symmnumber: 1
zpe: 641462.5 jmol-1
zpe.correction: 0.244320 hartree
zpe.thermalcorrener: 0.260975 hartree
zpe.thermalcorrenthalpy: 0.261920 hartree
zpe.thermalcorrgfe: 0.196445 hartree
zpe.sumelectzpe: -723.681916 hartree
zpe.sumelectthermal: -723.665261 hartree
zpe.sumelectthermalent: -723.664317 hartree
zpe.sumelectthermalfe: -723.729791 hartree
dipole: -0.0183 0.4594 0.0076
dipole: 0.4599
quadrupole: -75.2491 -78.4889 -94.2923
quadrupole: -0.2855 12.3643 0.3296
quadrupole: 7.4277 4.1878 -11.6155 -0.2855 12.3643 0.3296
hfenergy: -723.9262361 hartree
pointgroup: C01 [X(C8H16N2O4)]
dipole: -0.0087327 0.0193974 -0.1796734 debye
polarizability: 143.7316327|-1.849011|103.8289734|-0.5693078|1.1351495|95.6459472 unknown
InChI: InChI=1S/C8H16N2O4/c1-9(5-7(11)12)3-4-10(2)6-8(13)14/h11,13H,3-6H2,1-2H3
charge 0 multiplicity 1
30 atoms
O  5.08919 0.447373 1.385895
O  -5.080985 -0.750977 1.329666
O  4.409772 -1.472087 0.267726
O  -4.380703 1.36261 0.666933
N  1.895618 -0.139668 -0.411641
N  -1.905786 0.18205 -0.350497
C  0.573182 0.527018 -0.304932
C  -0.58483 -0.492374 -0.410849
C  2.955908 0.567228 0.314152
C  -2.956339 -0.653264 0.237995
C  2.276064 -0.469756 -1.803327
C  -2.3123 0.798024 -1.632662
C  4.176955 -0.298052 0.615335
C  -4.163055 0.13754 0.73768
H  0.489307 1.016121 0.681998
H  0.451974 1.330504 -1.072369
H  -0.476436 -1.107096 -1.337906
H  -0.489152 -1.187122 0.442626
H  2.56984 0.918274 1.288643
H  3.336477 1.481892 -0.212257
H  -2.553945 -1.197748 1.11194
H  -3.356998 -1.439579 -0.454837
H  1.465121 -1.037495 -2.288414
H  3.174048 -1.107869 -1.79935
H  2.478486 0.442747 -2.419917
H  -1.501484 1.440835 -2.013014
H  -3.196808 1.435056 -1.472876
H  -2.548957 0.036176 -2.418493
H  5.887166 -0.114845 1.580916
H  -5.867729 -0.236415 1.656938
