program: Gaussian 09
title: 000227163
version: EM64L-G09RevD.01
frameworkgroup: C1[X(C21H24Cl4N2)]
method: RPBEPBE
basis: SDD
operation: Freq
keyword: #p
keyword: freq=noraman
keyword: PBEPBE/SDD
title: #p freq=noraman PBEPBE/SDD
converged: YES YES NO NO
title: Mulliken charges:
elementType: Cl Cl Cl Cl N N C C C C C C C C C C C C C C C C C C C C C H H H H H H H H H H H H H H H H H H H H H H H H
charge: -0.061260 -0.061786 -0.061785 -0.061261 -0.185567 -0.185563 -0.710374 0.286288 0.286284 0.202885 0.202885 -0.612273 -0.612272 0.483340 0.483335 -0.436566 -0.436568 -0.387961 -0.387958 -0.387644 -0.389101 -0.389104 -0.387647 -0.586696 -0.586778 -0.586782 -0.586699 0.244889 0.244889 0.245256 0.245258 0.237461 0.237461 0.230534 0.230535 0.247051 0.249493 0.248928 0.249666 0.248929 0.249669 0.247051 0.249496 0.294269 0.267547 0.295006 0.268209 0.295007 0.268210 0.294269 0.267548
chargesum: 0.00000
title: Mulliken charges with hydrogens summed into heavy atoms:
elementType: Cl Cl Cl Cl N N C C C C C C C C C C C C C C C C C C C C C
charge: -0.061260 -0.061786 -0.061785 -0.061261 -0.185567 -0.185563 -0.220596 0.286288 0.286284 0.202885 0.202885 -0.367017 -0.367014 0.483340 0.483335 -0.199106 -0.199107 -0.157428 -0.157423 0.108900 0.109493 0.109494 0.108901 -0.024880 -0.023563 -0.023565 -0.024882
polarizability: 5.28968752e+02 2.50966762e-04 3.14793265e+02 -4.58327280e-01 1.55587182e-03 1.53365688e+02
1716.lowfreq: -5.2208 -3.1418 -0.0002 0.0003 0.0020 4.1555 11.8401 14.8557 25.2524
frequency: 11.6903 14.5893 25.2460 28.3600 30.4076 38.1350 38.5908 52.9169 66.1088 93.2097 105.4743 116.4624 119.2691 133.5844 144.7701 171.1825 182.0629 205.0207 210.2313 210.8440 217.4667 238.1064 241.4646 241.6664 253.9681 283.1434 304.1004 356.3249 365.9234 388.2548 411.4093 429.1533 434.2447 478.0466 483.3940 534.7589 535.5284 544.7525 559.1040 576.3288 606.7846 610.4739 662.0780 667.6589 689.6569 690.3596 707.3633 711.4149 712.0445 752.9910 755.4664 780.9244 781.1355 787.5546 789.5230 805.5179 815.5053 843.8236 860.9998 874.2208 874.6031 937.5173 939.5002 957.5527 962.6439 965.4642 994.8268 997.1163 997.4033 1033.3670 1033.5826 1034.4324 1034.8225 1041.2296 1045.6614 1105.3496 1119.4268 1120.5870 1136.2801 1141.6406 1155.1430 1159.3266 1196.4730 1205.4710 1211.8425 1220.6416 1220.8094 1250.9015 1254.3179 1254.3590 1255.0206 1256.5410 1274.6538 1283.9845 1291.7274 1292.6820 1307.2244 1315.2725 1351.4753 1352.0224 1353.4442 1355.2809 1367.0031 1375.8382 1379.6654 1391.1426 1427.8677 1453.9102 1454.4949 1458.9608 1459.2677 1461.1527 1462.6115 1478.1637 1481.3112 1481.6889 1496.2279 1500.6426 1503.1337 1577.9328 1588.5822 1632.7557 1632.8750 2982.9889 3010.0433 3010.0457 3015.5544 3015.7245 3027.3263 3063.0294 3063.0359 3063.3192 3063.3260 3066.7786 3066.7873 3071.8659 3071.8922 3127.7882 3130.2558 3142.2786 3142.6581 3148.2555 3148.2860 3148.6630 3148.6926 3159.8203 3160.5481
redmass: 15.7319 10.3114 18.9568 22.4802 11.2701 8.9659 11.6207 4.2696 5.6333 3.3942 3.9984 2.6327 2.6359 2.4612 3.8420 8.6716 4.4430 5.7532 4.1347 4.4500 5.5326 3.5713 2.8108 4.1370 4.3607 4.1450 3.8039 4.7396 5.0295 2.7833 5.4797 2.7773 3.0085 2.9620 5.0178 4.8935 4.3003 3.0881 3.9224 5.3318 2.8995 5.0470 7.0542 6.5638 5.4252 5.2527 4.5606 3.3766 4.6301 3.4886 5.5038 1.1292 1.1332 1.1526 1.1804 1.4309 1.6255 1.4405 1.4479 4.8439 3.6903 1.4304 1.3952 2.1610 2.6133 2.3526 3.1302 1.4200 1.5050 3.2192 4.0548 3.2259 3.4719 1.8919 1.6954 2.7270 1.4454 1.4178 1.1409 1.8208 1.5310 1.4522 1.5754 1.8141 1.6837 2.2593 2.2729 1.4704 1.1627 1.1615 1.1614 1.2284 1.4112 1.3955 1.1927 1.2358 1.4261 1.9456 1.3439 1.2547 1.3750 1.4808 7.4250 2.5477 1.6089 2.5528 1.1250 2.0179 1.6862 1.0984 1.0986 1.4756 1.6323 1.7262 1.1560 1.4077 2.0482 1.1218 1.4820 7.2911 6.6714 7.1926 7.3029 1.0608 1.0601 1.0601 1.0608 1.0608 1.0995 1.0674 1.0674 1.0587 1.0586 1.0922 1.0922 1.1027 1.1027 1.0887 1.0886 1.0907 1.0909 1.1114 1.1113 1.1114 1.1114 1.0939 1.0941
irintensity: 0.0118 0.1468 0.3853 0.0426 1.8516 0.1428 0.1552 1.2680 2.7713 2.9868 0.2717 0.1446 0.0117 2.8080 0.5936 0.0036 0.0093 10.5684 2.1025 0.4339 3.3764 25.8652 0.6571 11.6065 2.4705 0.0090 4.9264 26.4202 0.1237 1.9011 2.4083 6.5425 0.0911 1.7373 1.6143 40.1759 0.0915 0.9731 3.9605 1.0413 0.4865 2.4892 182.6751 0.0005 165.7525 35.8254 28.7840 1.4052 8.9781 0.2657 0.0145 0.6293 5.0270 27.9469 0.1952 86.6741 0.0571 32.3376 0.0303 0.0019 3.8345 0.7504 0.0001 17.9609 44.6539 0.3161 36.0567 6.0563 3.5425 0.1910 0.6532 0.1264 0.1638 0.0190 8.9767 8.8166 3.3093 66.9844 0.0865 170.8237 2.2398 2.8790 56.6793 0.1114 8.3638 56.3186 12.5315 1.9502 22.4686 25.1776 28.2379 14.0405 146.3358 6.8099 4.5844 20.3286 0.1773 0.0965 101.3540 0.1865 123.4538 6.3082 24.1982 1.3351 51.9022 13.7197 14.3962 71.2344 7.7982 25.0459 0.5864 75.3666 4.1661 375.9280 17.4516 212.6864 1.2934 114.1122 2.1331 70.3659 16.0542 3.4837 377.5279 13.9128 41.0810 12.8070 50.5068 1.2334 7.3752 3.5805 29.0409 8.0371 0.5298 15.9649 23.4326 21.3873 0.4218 22.5136 9.8931 24.1107 21.2633 3.1825 12.8348 37.2194 0.1033 40.0527 21.7051
temp: 298.150 k
press: 1.00000 atm
elementType: 17 17 17 17 7 7 6 6 6 6 6 6 6 6 6 6 6 6 6 6 6 6 6 6 6 6 6 1 1 1 1 1 1 1 1 1 1 1 1 1 1 1 1 1 1 1 1 1 1 1 1
symmnumber: 1
zpe: 1065792.6 jmol-1
zpe.correction: 0.405939 hartree
zpe.thermalcorrener: 0.433397 hartree
zpe.thermalcorrenthalpy: 0.434341 hartree
zpe.thermalcorrgfe: 0.341801 hartree
zpe.sumelectzpe: -2762.395315 hartree
zpe.sumelectthermal: -2762.367856 hartree
zpe.sumelectthermalent: -2762.366912 hartree
zpe.sumelectthermalfe: -2762.459453 hartree
dipole: 0.0001 0.0848 0.0000
dipole: 0.0848
quadrupole: -212.7220 -211.1642 -190.7450
quadrupole: -0.0001 -1.5447 0.0007
quadrupole: -7.8449 -6.2871 14.1321 -0.0001 -1.5447 0.0007
hfenergy: -2762.8012536 hartree
pointgroup: C01 [X(C21H24Cl4N2)]
dipole: 0.0000189 -0.0333448 -0.0000062 debye
polarizability: 528.9688387|-0.0070064|314.7932655|-0.4212655|-0.0005299|153.365601 unknown
InChI: InChI=1S/C21H24Cl4N2/c22-5-9-26(10-6-23)18-1-3-20-16(14-18)13-17-15-19(2-4-21(17)20)27(11-7-24)12-8-25/h1-4,14-15H,5-13H2
charge 0 multiplicity 1
51 atoms
Cl 7.513383 2.938396 -1.090621
Cl 6.06827 -3.909875 1.231245
Cl -6.068473 -3.909553 -1.230999
Cl -7.513235 2.938886 1.090608
N  4.919988 -0.100675 0.041829
N  -4.920005 -0.10037 -0.041718
C  -0.000054 -1.505245 0.000048
C  1.194212 -0.553388 0.007563
C  -1.194259 -0.553312 -0.007443
C  0.73546 0.798378 0.006007
C  -0.735421 0.798425 -0.005845
C  2.559642 -0.865784 0.023163
C  -2.559709 -0.865622 -0.023056
C  3.53077 0.187218 0.029318
C  -3.530771 0.187442 -0.029192
C  1.684985 1.841979 0.015569
C  -1.684881 1.842086 -0.015375
C  3.062226 1.53937 0.023304
C  -3.062141 1.539563 -0.023129
C  5.924522 0.971388 0.131165
C  5.418898 -1.482954 -0.02922
C  -5.418998 -1.482616 0.029378
C  -5.924479 0.971746 -0.131101
C  6.236854 1.551707 -1.261921
C  5.459413 -2.123154 1.371877
C  -5.459496 -2.122879 -1.371691
C  -6.236765 1.552149 1.261959
H  0.005954 -2.167427 -0.888014
H  -0.006103 -2.167449 0.888095
H  2.867588 -1.916164 0.036239
H  -2.867722 -1.915982 -0.036167
H  1.369226 2.891407 0.011533
H  -1.369056 2.891494 -0.011302
H  3.773181 2.37061 0.01946
H  -3.773042 2.370849 -0.01925
H  6.854045 0.564408 0.567659
H  5.584524 1.775607 0.807472
H  6.437973 -1.481761 -0.455497
H  4.796117 -2.094313 -0.705983
H  -6.438088 -1.481348 0.45562
H  -4.796273 -2.093979 0.706188
H  -6.854029 0.564804 -0.567578
H  -5.584435 1.775914 -0.807443
H  5.355992 2.008449 -1.735028
H  6.691391 0.80655 -1.931695
H  4.465077 -2.1787 1.837025
H  6.170101 -1.61619 2.041525
H  -4.465143 -2.178511 -1.836794
H  -6.170123 -1.615901 -2.041392
H  -5.355873 2.008877 1.735027
H  -6.691324 0.807047 1.931779
