program: Gaussian 09
title: 000227161
version: EM64L-G09RevD.01
frameworkgroup: C1[X(C17H15Cl2NO)]
method: RPBEPBE
basis: SDD
operation: Freq
keyword: #p
keyword: freq=noraman
keyword: PBEPBE/SDD
title: #p freq=noraman PBEPBE/SDD
converged: NO YES NO NO
title: Mulliken charges:
elementType: Cl Cl O N C C C C C C C C C C C C C C C C C H H H H H H H H H H H H H H H
charge: -0.053727 -0.048642 -0.156677 -0.178820 0.297224 0.193843 0.484607 0.290632 0.221592 -0.578555 -0.320763 -0.431233 -0.380716 -0.390663 -0.388948 -0.406237 -0.418590 -0.586253 -0.585514 -0.216746 -0.237275 0.285003 0.244633 0.251681 0.249710 0.250718 0.256563 0.236541 0.245505 0.278685 0.292436 0.270899 0.297110 0.267014 0.229527 0.235436
chargesum: 0.00000
title: Mulliken charges with hydrogens summed into heavy atoms:
elementType: Cl Cl O N C C C C C C C C C C C C C C C C C
charge: -0.053727 -0.048642 -0.156677 -0.178820 0.297224 0.193843 0.484607 0.290632 0.221592 -0.293552 -0.320763 -0.186600 -0.144175 0.110727 0.118334 -0.160731 -0.139906 -0.022918 -0.021390 0.012780 -0.001839
polarizability: 3.82699611e+02 -5.71452574e+00 2.35254293e+02 1.15165173e+00 2.63087551e+01 1.05546840e+02
1716.lowfreq: -6.6013 -4.2768 -0.0004 0.0020 0.0024 3.5042 24.4443 29.4114 34.8645
frequency: 24.3836 29.3996 34.8581 37.0497 72.9129 103.7342 113.3209 134.4774 140.6584 158.5659 188.9872 191.5179 209.2677 240.7616 254.1133 288.5847 315.0853 340.6909 381.9576 405.7337 434.9449 462.2350 491.5266 508.3396 533.0299 558.6268 584.5903 588.1115 640.2019 667.3595 686.1793 699.4580 705.6090 724.9199 752.0551 779.3546 783.1169 790.0482 805.6475 824.9442 829.7334 893.1182 910.2574 922.1282 949.4175 965.1989 967.6647 994.8588 998.3549 999.0583 1026.5205 1033.2868 1035.1734 1046.6756 1073.8484 1104.1194 1119.8714 1151.8692 1167.3317 1182.1723 1202.5795 1219.1779 1232.6411 1255.2502 1257.1772 1274.1519 1287.7928 1294.7906 1300.1903 1350.3443 1354.1684 1359.0123 1383.5726 1394.3337 1446.6097 1448.6868 1458.1685 1459.6065 1471.1088 1486.6423 1493.3794 1508.9008 1588.9456 1597.6738 1603.5730 1628.1050 1639.5387 3015.9365 3020.9814 3062.9599 3063.3480 3072.3014 3077.6227 3128.6451 3133.9731 3141.8936 3147.0061 3147.6059 3151.3664 3156.4406 3164.0759 3167.6667
redmass: 9.0807 8.4921 11.0646 11.2969 4.9247 2.9503 2.5868 4.3960 4.6267 5.0959 5.6374 9.7883 4.3597 4.3814 5.6697 4.6218 5.2690 4.1880 5.1566 3.4428 3.0905 3.3604 4.4309 5.8037 6.1480 4.6304 3.2043 6.1638 6.9134 7.4071 4.0182 5.2979 4.9426 5.8082 1.5268 2.4695 1.1314 1.1623 6.1553 1.5810 2.5863 1.4628 1.9002 4.9017 1.4148 2.9202 1.4796 1.3566 1.6659 2.7073 1.8139 4.2413 3.4517 1.7609 2.8968 2.0829 1.4757 1.6201 1.3145 1.6043 1.9467 2.1929 1.8751 1.1648 1.1771 1.4212 1.2176 1.4880 1.6234 1.2893 1.3977 6.7650 1.7785 3.2998 2.4993 2.7914 1.1148 1.1079 2.8678 1.2589 2.5853 1.2414 7.5297 7.0778 7.9928 8.1547 9.2969 1.0601 1.0609 1.0569 1.0572 1.1038 1.1041 1.0861 1.0890 1.0897 1.1119 1.1119 1.0949 1.0910 1.0938 1.1002
irintensity: 1.0111 0.0251 1.7541 0.3122 3.6119 2.0197 1.9992 0.3228 0.7478 0.1057 0.3147 0.2106 3.3024 12.4381 4.7316 5.6069 1.6201 0.4673 18.0708 0.5424 0.1631 0.7442 7.7173 4.4537 6.7216 5.1383 2.7760 5.7074 9.1116 51.7654 5.8987 70.5031 40.2662 1.1505 69.6620 44.9472 2.6077 12.2755 10.9868 26.6552 0.1708 5.2456 11.9811 67.7034 0.9675 1.1198 5.8044 0.0383 2.2155 1.7625 2.9027 0.5664 0.0603 0.7653 18.3375 14.2742 31.7973 6.6741 0.6354 2.6780 110.5109 27.9802 6.7315 22.0277 24.1682 33.4002 25.7609 48.7013 0.1648 19.6007 78.1326 0.4403 44.2881 1.0591 46.5287 4.1170 32.6210 3.3976 181.2295 27.2361 182.8277 128.0599 9.2814 88.5778 204.6925 39.2598 144.9427 22.5357 20.1097 5.1046 25.9346 7.8052 9.0658 6.1209 9.5741 3.9760 4.1541 20.9704 15.9046 10.2436 30.0923 31.2224
temp: 298.150 k
press: 1.00000 atm
elementType: 17 17 8 7 6 6 6 6 6 6 6 6 6 6 6 6 6 6 6 6 6 1 1 1 1 1 1 1 1 1 1 1 1 1 1 1
symmnumber: 1
zpe: 727957.3 jmol-1
zpe.correction: 0.277264 hartree
zpe.thermalcorrener: 0.296148 hartree
zpe.thermalcorrenthalpy: 0.297093 hartree
zpe.thermalcorrgfe: 0.227052 hartree
zpe.sumelectzpe: -1705.426839 hartree
zpe.sumelectthermal: -1705.407955 hartree
zpe.sumelectthermalent: -1705.407010 hartree
zpe.sumelectthermalfe: -1705.477051 hartree
dipole: 0.3402 -3.6288 -1.0076
dipole: 3.7814
quadrupole: -128.9510 -153.1596 -138.0585
quadrupole: -11.3458 -2.0192 0.5896
quadrupole: 11.1054 -13.1033 1.9979 -11.3458 -2.0192 0.5896
hfenergy: -1705.704103 hartree
pointgroup: C01 [X(C17H15Cl2N1O1)]
dipole: 0.1519975 1.4386961 0.3469421 debye
polarizability: 382.8323415|3.5272203|236.8088075|0.4338418|21.7357743|103.8595945 unknown
InChI: InChI=1S/C17H15Cl2NO/c18-7-9-20(10-8-19)12-5-6-14-13-3-1-2-4-15(13)17(21)16(14)11-12/h1-6,11H,7-10H2
charge 0 multiplicity 1
36 atoms
Cl -5.409128 3.313496 -0.406213
Cl -4.299134 -3.894062 0.331583
O  1.855336 -2.685912 -0.637005
N  -2.931394 0.013908 0.040556
C  1.276681 0.778986 0.184595
C  0.763894 -0.515221 -0.118897
C  -1.542091 0.256317 0.08537
C  2.759776 0.71886 0.156186
C  3.152573 -0.619019 -0.163765
C  -0.602072 -0.79748 -0.169921
C  1.920426 -1.458033 -0.349716
C  0.365958 1.817443 0.440341
C  -1.02387 1.557626 0.386554
C  -3.906839 1.071133 0.358924
C  -3.47285 -1.304065 -0.340782
C  3.741821 1.700652 0.378873
C  4.501888 -0.989804 -0.264167
C  -4.19032 1.948187 -0.876703
C  -3.544705 -2.250182 0.873976
C  5.109896 1.328814 0.27765
C  5.491442 0.00213 -0.039465
H  -0.916229 -1.819855 -0.399672
H  0.707587 2.831296 0.676241
H  -4.849798 0.605245 0.69445
H  -3.551048 1.698751 1.194782
H  -4.489249 -1.169592 -0.750878
H  -2.868046 -1.763746 -1.141598
H  -1.706875 2.389906 0.579468
H  3.470939 2.733052 0.625408
H  4.772626 -2.021996 -0.510167
H  -3.290076 2.459741 -1.245846
H  -4.670289 1.381242 -1.687994
H  -2.553412 -2.4921 1.282916
H  -4.203831 -1.861832 1.664609
H  5.885404 2.08422 0.448452
H  6.553411 -0.255204 -0.110445
