program: Gaussian 09
title: 000227160
version: EM64L-G09RevD.01
frameworkgroup: C1[X(C17H17Cl2N)]
method: RPBEPBE
basis: SDD
operation: Freq
keyword: #p
keyword: freq=noraman
keyword: PBEPBE/SDD
title: #p freq=noraman PBEPBE/SDD
converged: NO YES NO NO
title: Mulliken charges:
elementType: Cl Cl N C C C C C C C C C C C C C C C C C H H H H H H H H H H H H H H H H H
charge: -0.060459 -0.060853 -0.184113 0.301600 -0.702551 0.187933 0.273269 0.185271 0.482714 -0.606694 -0.431523 -0.386125 -0.388753 -0.388235 -0.424619 -0.399325 -0.240694 -0.235590 -0.586134 -0.586656 0.244758 0.244210 0.245680 0.238366 0.231504 0.247328 0.249729 0.249063 0.249956 0.239593 0.236659 0.224248 0.223988 0.294829 0.267794 0.295287 0.268545
chargesum: 0.00000
title: Mulliken charges with hydrogens summed into heavy atoms:
elementType: Cl Cl N C C C C C C C C C C C C C C C C C
charge: -0.060459 -0.060853 -0.184113 0.301600 -0.213583 0.187933 0.273269 0.185271 0.482714 -0.361015 -0.193158 -0.154620 0.108303 0.110783 -0.185025 -0.162666 -0.016446 -0.011601 -0.023511 -0.022824
polarizability: 3.61847423e+02 4.86778144e-01 2.24587490e+02 2.51932206e+00 2.45897598e+01 1.09596147e+02
1716.lowfreq: -5.5291 -4.3627 -0.0022 -0.0020 0.0011 3.2340 25.3970 29.8919 37.6191
frequency: 25.3476 29.8606 37.5884 38.5154 72.2030 106.9255 116.1506 142.8502 151.3418 191.5449 196.0185 208.2112 236.6033 242.2328 275.2555 306.5997 343.9074 378.3364 422.3099 432.4307 464.8938 485.6422 509.0057 540.3892 550.0784 574.1596 593.2504 641.5384 663.5650 692.5129 700.8988 706.5436 738.3868 746.2739 772.1608 781.3711 789.0940 811.5951 819.1620 849.2171 869.4961 875.0302 929.8292 942.1019 962.8950 965.3240 982.9716 995.0138 996.9028 1024.3729 1033.3627 1034.5810 1043.4755 1095.7452 1117.9854 1130.3279 1131.2896 1156.3037 1168.0543 1186.7267 1199.9630 1207.8056 1221.6503 1248.3376 1252.5503 1255.6258 1279.1680 1292.2762 1304.3609 1310.4096 1349.9622 1352.9313 1370.5710 1382.7703 1392.2559 1427.6070 1445.8129 1456.2474 1458.0526 1462.9568 1465.2455 1483.8123 1495.4688 1505.6213 1582.6406 1591.1824 1621.0030 1633.0317 2980.7132 3012.5153 3018.0529 3024.0528 3063.6552 3064.0407 3069.1072 3074.7608 3119.9670 3126.8248 3130.1116 3141.1912 3144.2353 3148.5864 3149.1347 3160.3194 3161.6136
redmass: 7.4321 8.5757 9.9761 6.1329 4.6906 2.8593 2.5402 3.8391 3.8621 5.2582 10.4989 4.2098 2.2972 3.7555 3.9217 4.4951 4.0475 4.8977 2.7527 2.8621 3.2609 4.5336 3.3939 5.1133 5.0091 4.6574 2.9718 6.5065 6.9517 5.2238 4.5098 3.0346 1.7072 5.5524 1.9485 1.1289 1.1645 1.5797 4.3135 1.4554 1.3607 4.2326 1.6019 1.3958 2.4263 1.9185 1.3281 3.9157 1.5049 2.0580 4.2546 2.9100 1.8181 2.1361 1.4742 1.9097 1.1494 1.4355 1.1451 1.6104 1.7843 1.8829 2.2828 1.5997 1.1842 1.2013 1.4246 1.2012 1.4913 1.8967 1.3133 1.4014 6.1577 1.8741 3.5059 1.1510 2.6111 1.2662 1.0951 2.4895 2.6928 1.1584 2.8118 1.1937 7.0711 6.5345 7.2816 7.3113 1.0608 1.0600 1.0608 1.0993 1.0576 1.0592 1.1012 1.1036 1.0854 1.0893 1.0888 1.0945 1.0916 1.1114 1.1111 1.0998 1.0945
irintensity: 0.2926 0.3168 0.6619 0.8360 1.7260 1.4957 1.4645 0.5766 0.0981 0.8725 1.0705 2.5779 17.1573 8.5954 0.6640 7.6306 0.8092 11.9052 7.3275 0.3364 1.8797 3.1815 0.0354 6.5859 14.1452 1.7703 1.5924 7.7989 72.9839 90.8890 16.4841 5.4881 44.3118 0.9131 70.1139 2.8479 11.3905 21.5309 2.6828 12.8228 3.0969 0.7977 1.0345 0.4264 22.2940 13.5579 0.1582 2.9533 3.1809 12.4759 0.6321 0.1697 2.5776 10.0002 42.5846 50.1100 0.3274 15.8762 1.0722 1.5153 24.6429 6.8759 33.0026 19.2915 11.2890 18.8515 56.6908 7.3544 5.7900 4.0373 29.5092 65.7702 10.3878 48.8639 0.2001 17.4925 12.6584 41.5927 5.1363 147.8394 8.2215 32.3931 78.7440 76.3144 42.0945 3.6109 19.3296 224.5041 14.8179 25.7320 21.9419 8.1318 8.5566 19.0771 12.0075 10.3882 5.9896 7.7580 8.4871 32.3276 20.8307 11.8160 13.9113 52.4952 17.1289
temp: 298.150 k
press: 1.00000 atm
elementType: 17 17 7 6 6 6 6 6 6 6 6 6 6 6 6 6 6 6 6 6 1 1 1 1 1 1 1 1 1 1 1 1 1 1 1 1 1
symmnumber: 1
zpe: 775562.7 jmol-1
zpe.correction: 0.295396 hartree
zpe.thermalcorrener: 0.313673 hartree
zpe.thermalcorrenthalpy: 0.314617 hartree
zpe.thermalcorrgfe: 0.246126 hartree
zpe.sumelectzpe: -1631.460474 hartree
zpe.sumelectthermal: -1631.442197 hartree
zpe.sumelectthermalent: -1631.441253 hartree
zpe.sumelectthermalfe: -1631.509745 hartree
dipole: 0.5922 0.3791 0.1141
dipole: 0.7123
quadrupole: -135.5380 -140.3622 -133.6668
quadrupole: 0.0387 0.9477 3.7762
quadrupole: 0.9843 -3.8399 2.8555 0.0387 0.9477 3.7762
hfenergy: -1631.7558702 hartree
pointgroup: C01 [X(C17H17Cl2N1)]
dipole: -0.2311666 -0.1527829 0.0419847 debye
polarizability: 361.8220017|2.3574253|225.3224448|-1.4626207|-22.9111458|108.8866138 unknown
InChI: InChI=1S/C17H17Cl2N/c18-7-9-20(10-8-19)15-5-6-17-14(12-15)11-13-3-1-2-4-16(13)17/h1-6,12H,7-11H2
charge 0 multiplicity 1
37 atoms
Cl 5.205157 3.374238 0.273195
Cl 4.249865 -3.935695 -0.155071
N  2.845714 -0.030058 -0.021374
C  -0.838901 -0.69921 0.200117
C  -1.966088 -1.68553 0.491076
C  -1.386199 0.569178 -0.156419
C  -3.220794 -0.846282 0.26692
C  -2.85583 0.482619 -0.115088
C  1.4420 0.15891 -0.065301
C  0.544835 -0.913884 0.243679
C  -0.510825 1.630599 -0.468366
C  0.882849 1.429007 -0.419707
C  3.778366 1.047728 -0.390643
C  3.435106 -1.30757 0.411432
C  -4.572407 -1.209918 0.38696
C  -3.852698 1.44916 -0.377669
C  -5.572603 -0.238722 0.123285
C  -5.212467 1.078471 -0.255534
C  4.028634 1.990285 0.802983
C  3.523405 -2.298299 -0.766008
H  -1.912349 -2.080189 1.524972
H  -1.930761 -2.564456 -0.182684
H  0.924018 -1.905142 0.510863
H  -0.89853 2.617791 -0.744078
H  1.535625 2.274083 -0.656556
H  4.739166 0.604949 -0.707059
H  3.397301 1.622895 -1.25253
H  4.450287 -1.12557 0.806316
H  2.851537 -1.753595 1.235883
H  -4.857069 -2.227399 0.67978
H  -3.583648 2.470386 -0.670717
H  -6.631024 -0.507662 0.212829
H  -5.997203 1.816971 -0.455433
H  3.110459 2.488637 1.144759
H  4.525181 1.47884 1.640832
H  2.537017 -2.543348 -1.18446
H  4.201473 -1.946217 -1.557384
