program: Gaussian 09
title: 000227158
version: EM64L-G09RevD.01
frameworkgroup: C1[X(C14H10N2O3)]
method: RPBEPBE
basis: SDD
operation: Freq
keyword: #p
keyword: freq=noraman
keyword: PBEPBE/SDD
title: #p freq=noraman PBEPBE/SDD
converged: NO YES NO YES
title: Mulliken charges:
elementType: O O O N N C C C C C C C C C C C C C C H H H H H H H H H H
charge: -0.216414 -0.215863 -0.245730 -0.411926 0.015317 -0.690831 0.314001 0.314749 0.197956 0.199834 -0.565780 -0.579598 -0.376985 -0.366987 0.507239 0.408369 -0.460178 -0.388053 -0.067795 0.258961 0.258961 0.321920 0.299125 0.245291 0.248050 0.224096 0.286432 0.308594 0.177243
chargesum: 0.00000
title: Mulliken charges with hydrogens summed into heavy atoms:
elementType: O O O N N C C C C C C C C C C C C C C
charge: -0.216414 -0.215863 -0.245730 -0.103332 0.015317 -0.172908 0.314001 0.314749 0.197956 0.199834 -0.243860 -0.280472 -0.131694 -0.118937 0.507239 0.408369 -0.236082 -0.101621 0.109449
polarizability: 3.99033070e+02 -2.33469456e+00 1.85096209e+02 -2.57838761e-03 -1.40159806e-03 6.95363854e+01
1716.lowfreq: -5.0026 -0.0010 -0.0006 -0.0002 5.8800 7.0696 38.7095 56.3965 68.1245
frequency: 38.7090 56.3866 68.1224 99.3427 112.7542 161.5778 167.4417 206.0046 223.8339 243.2493 297.3251 314.6655 345.8233 394.3278 425.4667 438.7510 445.5552 474.9019 514.9048 540.6653 559.4792 580.0073 593.7391 653.1086 661.8551 681.8662 700.9759 719.3146 736.9916 763.9283 770.5397 815.8341 826.3791 853.8708 893.9180 894.5259 929.9047 937.6384 949.0721 951.2945 982.9388 989.3878 994.2496 1068.2988 1093.2012 1117.6599 1138.2973 1138.5626 1169.6197 1184.6542 1200.8892 1209.8435 1235.3790 1266.9061 1286.5347 1311.7632 1354.3407 1362.9583 1387.4775 1402.4221 1425.6332 1440.9617 1449.4698 1463.4941 1493.6970 1508.5358 1588.8760 1593.2875 1619.9197 1628.0607 1638.0314 2943.0698 2990.5972 3034.8783 3119.0159 3147.4466 3151.8439 3173.6634 3183.3480 3185.3424 3514.8400
redmass: 7.5514 8.7205 7.4805 8.5937 4.7074 4.0169 9.4324 3.8944 8.2587 2.2387 9.9831 4.0979 6.3203 3.8674 2.7112 7.5277 3.1042 5.9590 3.5753 4.9407 5.8394 6.4589 3.0679 1.1780 7.6115 4.7216 6.0782 3.6518 7.0599 7.2190 3.4301 5.9957 1.5132 1.5677 4.6806 1.6484 3.7046 1.4460 1.5178 1.3986 1.7788 1.3933 7.2063 1.9582 2.3247 1.9653 1.5995 1.1529 1.7250 2.6885 2.5347 2.5021 2.0943 1.6617 1.4113 2.8742 7.7725 2.4397 1.6160 4.8281 1.2200 3.5577 3.5517 4.0012 3.8482 2.2676 8.0437 6.2554 6.9830 6.2120 5.4499 1.0867 1.0615 1.0990 1.0886 1.0908 1.0957 1.0928 1.0938 1.0950 1.0770
irintensity: 1.0758 1.8005 2.1983 1.6190 14.2745 3.4700 10.0184 4.3541 0.9376 7.7541 5.8502 12.3171 1.0692 4.3468 9.5110 1.2301 0.0758 0.7152 0.2299 0.4808 0.6848 1.8938 5.0809 67.0159 1.1216 4.5785 7.5885 21.0846 19.4749 2.5143 1.7505 7.6291 80.5643 16.4893 11.9034 14.4738 1.0348 0.0153 0.5728 1.5650 40.0445 0.3862 1.5769 38.2518 28.5882 45.3806 12.6857 0.0163 12.0058 13.0881 421.2860 347.0400 79.1528 42.8151 5.2053 83.2363 71.1214 37.0086 95.5069 23.8916 14.6659 14.1858 70.6091 146.3902 144.8773 180.7610 10.8431 121.3239 180.1055 97.1759 160.9083 154.0614 4.9145 3.5408 20.7139 3.0672 18.0074 1.3851 4.6962 1.5974 19.4676
temp: 298.150 k
press: 1.00000 atm
elementType: 8 8 8 7 7 6 6 6 6 6 6 6 6 6 6 6 6 6 6 1 1 1 1 1 1 1 1 1 1
symmnumber: 1
zpe: 557659.9 jmol-1
zpe.correction: 0.212401 hartree
zpe.thermalcorrener: 0.227287 hartree
zpe.thermalcorrenthalpy: 0.228231 hartree
zpe.thermalcorrgfe: 0.169579 hartree
zpe.sumelectzpe: -873.304717 hartree
zpe.sumelectthermal: -873.289831 hartree
zpe.sumelectthermalent: -873.288887 hartree
zpe.sumelectthermalfe: -873.347539 hartree
dipole: -7.4195 4.6792 0.0010
dipole: 8.7718
quadrupole: -132.5584 -103.3403 -111.4688
quadrupole: -14.1396 0.0006 -0.0035
quadrupole: -16.7692 12.4489 4.3203 -14.1396 0.0006 -0.0035
hfenergy: -873.5171181 hartree
pointgroup: C01 [X(C14H10N2O3)]
dipole: 2.9221458 -1.8360567 0.0011375 debye
polarizability: 399.0402956|-1.9759024|185.0889728|0.0328138|-0.0290463|69.5363958 unknown
InChI: InChI=1S/C14H10N2O3/c17-8-15-11-1-3-13-9(6-11)5-10-7-12(16(18)19)2-4-14(10)13/h1-4,6-8,15H,5H2
charge 0 multiplicity 1
29 atoms
O  -5.781044 -0.444545 -0.000526
O  -5.152486 1.749839 -0.001105
O  5.283087 1.966459 -0.000444
N  4.896948 -0.367667 0.000605
N  -4.879655 0.484208 -0.000506
C  0.139999 1.528444 -0.000171
C  1.247735 0.483375 0.000121
C  -1.126216 0.683297 -0.000168
C  0.679295 -0.82774 0.000319
C  -0.783571 -0.708418 0.000143
C  2.635344 0.682962 0.000208
C  -2.464884 1.090305 -0.000427
C  1.521117 -1.963617 0.000611
C  -1.794608 -1.69896 0.000224
C  3.477056 -0.465848 0.000489
C  -3.458793 0.079403 -0.000313
C  2.914723 -1.77694 0.000687
C  -3.144818 -1.301731 0.00002
C  5.692417 0.775044 0.000421
H  0.196444 2.190468 0.885661
H  0.196638 2.190146 -0.886231
H  3.084314 1.677958 0.000085
H  -2.769976 2.140025 -0.000652
H  1.106323 -2.976931 0.00078
H  -1.539186 -2.76347 0.000476
H  3.580418 -2.64937 0.000916
H  -3.961805 -2.027613 0.000109
H  5.403912 -1.257283 0.000811
H  6.774473 0.512099 0.000056
