program: Gaussian 09
title: 000227157
version: EM64L-G09RevD.01
frameworkgroup: C1[X(C15H12N2O2)]
method: RPBEPBE
basis: SDD
operation: Freq
keyword: #p
keyword: freq=noraman
keyword: PBEPBE/SDD
title: #p freq=noraman PBEPBE/SDD
converged: YES YES NO NO
title: Mulliken charges:
elementType: O O N N C C C C C C C C C C C C C C C H H H H H H H H H H H H
charge: -0.246997 -0.250054 -0.397290 -0.411832 -0.701575 0.000386 0.303698 0.308868 0.228982 0.312880 -0.582580 -0.314530 -0.454561 0.510070 -0.374171 -0.517961 -0.224429 -0.072042 -0.071767 0.251595 0.251594 0.320061 0.199830 0.245189 0.302659 0.220133 0.228979 0.291287 0.305901 0.164555 0.173124
chargesum: 0.00000
title: Mulliken charges with hydrogens summed into heavy atoms:
elementType: O O N N C C C C C C C C C C C C C C C
charge: -0.246997 -0.250054 -0.106004 -0.105931 -0.198386 0.000386 0.303698 0.308868 0.228982 0.312880 -0.262519 -0.114700 -0.209373 0.510070 -0.071513 -0.297828 0.004550 0.092513 0.101356
polarizability: 3.29866331e+02 -6.56326445e+00 2.11523362e+02 4.34865927e-02 9.86706094e-03 7.38416950e+01
1716.lowfreq: -5.1739 -0.0002 0.0005 0.0009 3.1542 9.2992 29.1196 37.7852 67.9108
frequency: 29.0879 37.7833 67.9050 85.1472 106.6323 146.9263 173.5588 190.4275 217.1759 240.3984 272.3361 289.8625 351.9933 356.1909 373.7011 403.3212 419.8780 482.6339 512.1934 525.3739 547.0098 558.6483 594.0233 596.7600 634.7358 642.1153 650.4442 718.4940 728.1522 764.9906 767.0258 795.4797 801.7974 817.8069 835.2029 902.7328 918.0251 928.2274 931.6902 944.4901 946.2323 952.1702 976.3358 989.4608 994.0060 1075.5650 1101.4489 1124.9270 1133.9707 1138.8285 1176.9779 1190.7501 1201.5591 1222.6779 1262.7693 1273.4019 1296.0313 1299.1384 1361.8964 1381.5541 1388.3738 1390.0535 1408.3115 1427.3279 1453.1250 1467.9617 1489.3600 1497.3232 1509.4704 1590.6362 1597.1284 1615.6658 1628.2667 1636.5775 1642.7429 2923.5079 2933.5596 2987.4038 3031.6480 3110.7086 3132.9811 3134.4387 3154.9960 3179.1232 3191.7621 3514.7965 3562.8386
redmass: 4.1621 7.8793 4.7468 4.5411 7.0356 8.2321 3.5634 3.3420 8.6074 2.1908 8.9321 3.4815 7.3993 3.2989 5.0575 3.4891 2.6740 5.9554 3.4361 4.6432 6.5469 2.9944 2.3428 5.3019 1.4534 6.6733 1.1951 3.4064 6.4354 2.5206 5.3110 1.3172 2.0796 6.1944 6.4908 1.5686 1.4499 1.4166 4.1971 1.6113 1.5688 4.6171 1.7955 7.3119 1.3260 2.0056 2.1626 2.5889 1.1527 2.5761 1.3758 1.2565 1.7889 1.6668 2.4699 2.4704 2.6814 1.4941 2.4610 1.8766 1.6146 2.1781 2.2277 1.1679 5.3641 2.9419 3.4181 2.0269 2.2607 5.5187 6.5225 6.7895 6.5156 5.0179 4.7472 1.0860 1.0864 1.0613 1.0990 1.0862 1.0878 1.0961 1.0958 1.0938 1.0952 1.0769 1.0759
irintensity: 1.2071 12.1616 0.5532 16.9833 2.8367 11.5962 11.6657 1.9441 8.8121 11.5773 2.0508 22.1712 9.2418 0.0230 0.2560 0.8285 6.5415 4.1566 0.0000 0.0666 0.5951 2.7331 0.3585 7.7961 86.1376 3.5980 30.5079 8.6615 4.9180 47.2952 2.6691 7.0161 103.6307 4.8553 13.4169 0.2261 1.9659 10.0567 1.0391 0.0005 4.4193 2.5710 23.4885 2.1981 7.6388 4.5987 18.3682 21.4671 0.0359 32.0640 6.4594 1.5989 4.1670 21.4935 10.6274 9.9475 20.4514 32.2479 15.4383 11.3641 53.6244 3.0492 161.4674 31.2000 210.3879 114.6052 189.2788 232.1115 38.0971 60.9532 104.7936 22.3800 96.1798 275.9543 220.3586 104.1882 148.7461 8.3787 5.2470 35.4419 5.7148 29.3373 24.3889 4.5168 5.4971 14.0692 44.1999
temp: 298.150 k
press: 1.00000 atm
elementType: 8 8 7 7 6 6 6 6 6 6 6 6 6 6 6 6 6 6 6 1 1 1 1 1 1 1 1 1 1 1 1
symmnumber: 1
zpe: 622418.0 jmol-1
zpe.correction: 0.237067 hartree
zpe.thermalcorrener: 0.252555 hartree
zpe.thermalcorrenthalpy: 0.253499 hartree
zpe.thermalcorrgfe: 0.193122 hartree
zpe.sumelectzpe: -837.469552 hartree
zpe.sumelectthermal: -837.454064 hartree
zpe.sumelectthermalent: -837.453120 hartree
zpe.sumelectthermalfe: -837.513497 hartree
dipole: 3.5445 -3.2932 0.0073
dipole: 4.8382
quadrupole: -135.3155 -89.3850 -114.8874
quadrupole: -26.1426 -0.0617 -0.0201
quadrupole: -22.1195 23.8109 -1.6914 -26.1426 -0.0617 -0.0201
hfenergy: -837.7066188 hartree
pointgroup: C01 [X(C15H12N2O2)]
dipole: 1.4067627 1.2816291 -0.0417549 debye
polarizability: 329.9348251|5.5778183|211.1343044|3.1994316|-6.1343701|74.1622586 unknown
InChI: InChI=1S/C15H12N2O2/c18-8-16-12-4-5-13-11(7-12)6-10-2-1-3-14(15(10)13)17-9-19/h1-5,7-9,16-17H,6H2
charge 0 multiplicity 1
31 atoms
O  -5.019485 1.894087 -0.185696
O  5.44443 -0.928371 0.081672
N  -2.66746 1.590546 -0.145215
N  4.339986 1.161285 -0.026006
C  0.451975 -2.151342 0.069722
C  -1.184744 -0.371161 -0.032392
C  1.139832 -0.798751 0.017594
C  -1.023959 -1.790009 0.034422
C  0.163255 0.248504 -0.041661
C  -2.5014 0.177166 -0.076215
C  2.518009 -0.546302 0.024521
C  0.625539 1.588462 -0.093634
C  -2.128444 -2.656261 0.059702
C  2.960102 0.804798 -0.028659
C  -3.620452 -0.699461 -0.050931
C  2.008523 1.858302 -0.086838
C  -3.427622 -2.095857 0.016631
C  -3.840146 2.337231 -0.193689
C  5.454266 0.330888 0.025981
H  0.719425 -2.712173 0.986499
H  0.741946 -2.79257 -0.785409
H  3.252361 -1.353225 0.069451
H  -0.04325 2.454926 -0.138862
H  -1.989767 -3.741507 0.111345
H  -4.625167 -0.274583 -0.084457
H  2.353194 2.899573 -0.127041
H  -4.306053 -2.750088 0.035216
H  -1.808601 2.140675 -0.162486
H  4.539454 2.164654 -0.067985
H  -3.612206 3.427684 -0.243103
H  6.397758 0.923778 0.012526
