program: Gaussian 09
title: 000227154
version: EM64L-G09RevD.01
frameworkgroup: C1[X(C21H15ClN2O)]
method: RPBEPBE
basis: SDD
operation: Freq
keyword: #p
keyword: freq=noraman
keyword: PBEPBE/SDD
title: #p freq=noraman PBEPBE/SDD
converged: NO YES NO NO
title: Mulliken charges:
elementType: Cl O N N C C C C C C C C C C C C C C C C C C C C C H H H H H H H H H H H H H H H
charge: -0.068785 -0.246229 0.015524 -0.450780 0.251180 0.311731 0.250666 0.277539 -0.509800 -0.573691 -0.397028 -0.419769 0.533908 -0.383731 -0.486078 -0.223702 -0.266799 0.323813 -0.367047 -0.367004 0.208940 -0.192786 -0.192697 -0.126441 -0.800436 0.357149 0.247992 0.247852 0.283481 0.221933 0.231161 0.235555 0.310763 0.254719 0.254715 0.254051 0.254039 0.238698 0.271837 0.235555
chargesum: 0.00000
title: Mulliken charges with hydrogens summed into heavy atoms:
elementType: Cl O N N C C C C C C C C C C C C C C C C C C C C C
charge: -0.068785 -0.246229 0.015524 -0.140018 0.251180 0.311731 0.250666 0.277539 -0.509800 -0.216542 -0.149036 -0.171917 0.533908 -0.100250 -0.264145 0.007459 -0.031243 0.323813 -0.112328 -0.112289 0.208940 0.061265 0.061342 -0.126441 -0.054346
polarizability: 4.22816011e+02 1.18681722e+01 2.99799079e+02 -1.02799087e-01 5.30476778e-02 1.38698095e+02
1716.lowfreq: -75.6936 -30.3290 -4.1041 -2.7635 -2.4384 -0.0010 -0.0009 0.0004 28.7454
frequency: -75.6904 -30.2335 28.7429 36.1625 38.6422 59.4838 79.9985 101.9098 122.2167 123.6709 147.6567 165.4032 207.4209 225.9544 262.2665 280.1461 293.5846 347.1252 347.9063 390.6973 397.3994 400.5615 427.2787 434.4668 463.2871 476.4987 512.0422 521.2469 540.4176 546.4332 572.1470 603.5347 626.4924 628.1246 640.5418 641.0624 662.0925 680.9646 701.6666 718.5057 743.7493 757.3585 797.9276 800.5522 815.7821 825.0120 827.2364 842.3417 854.0565 899.4055 928.3700 936.5204 951.0470 951.6201 962.0168 962.0704 973.8373 988.2525 991.9610 994.2704 1005.2545 1030.8951 1034.2291 1068.8909 1075.6298 1101.4206 1116.3066 1142.8620 1169.6163 1176.1466 1188.4597 1208.5013 1224.5114 1237.5030 1274.5763 1279.7866 1285.3816 1307.3983 1343.1548 1367.5206 1376.6119 1387.5200 1397.6535 1439.6998 1445.8663 1451.9913 1458.4912 1468.1723 1469.4307 1489.7772 1511.5255 1567.5197 1590.6268 1593.0584 1602.0685 1609.5708 1626.9051 1637.4249 1660.0527 2987.8548 3072.7484 3113.1832 3128.2886 3137.3058 3142.6410 3148.1488 3151.1706 3151.6430 3158.9149 3171.4076 3175.1370 3176.8218 3195.3811 3520.0243
redmass: 1.0440 4.1175 9.8492 6.5701 5.6098 4.6271 6.7410 4.2850 7.0884 5.0402 4.1519 7.2095 6.1842 5.2174 6.6283 4.1386 7.7369 6.2874 4.3424 9.1093 3.5981 3.1714 4.8719 3.7486 3.5596 4.3303 4.4108 5.4399 4.5434 4.6379 3.0889 3.2195 6.3232 7.7982 1.2473 5.7068 6.0706 3.7108 4.0670 5.1916 5.3634 1.3911 2.6778 4.7674 1.2530 1.8539 2.8092 1.8492 5.6759 1.6124 6.4232 1.3407 1.4196 1.3658 1.4390 2.4960 1.4826 2.9572 4.2447 1.3499 2.7604 1.6615 1.9846 2.7631 3.1410 1.3367 1.9297 1.6250 1.2942 1.1321 1.7965 2.3093 2.3774 2.8616 2.0048 1.6863 1.2570 2.1081 5.2363 5.9309 1.2603 3.8911 3.9517 1.9027 2.0465 1.5845 2.5951 1.0471 3.7057 3.8587 2.0129 7.8343 6.3698 6.7899 6.9516 7.1288 7.3549 5.2307 12.1012 1.0384 1.0983 1.0886 1.0863 1.0979 1.0914 1.0953 1.0885 1.0883 1.0958 1.0965 1.0976 1.0973 1.0936 1.0764
irintensity: 0.0140 0.1096 0.1834 0.9444 2.9620 8.9551 1.7277 0.0344 0.0927 0.4206 0.3278 6.6326 0.4699 0.1015 0.9385 1.3939 0.3909 3.6305 0.1091 4.3524 0.9124 0.4150 1.8760 0.1679 8.9170 29.0193 7.0893 3.0142 26.8854 4.8142 3.6935 10.7686 4.3471 3.1751 51.1225 14.2103 17.4717 1.2189 7.4768 3.3336 1.0844 83.8098 14.2549 15.5924 0.6796 46.4368 16.8355 31.4869 24.8633 0.1092 3.8241 1.2033 0.4004 0.2422 1.0952 35.0182 24.4873 22.7552 50.5658 0.0335 2.0510 7.6388 4.1707 41.5842 10.1507 13.1194 26.1632 31.4653 16.1818 1.8488 15.0169 17.9206 25.8809 147.6363 8.1169 25.4184 0.0205 28.0347 1.6809 87.9114 76.5050 86.6847 0.2738 34.8537 109.0365 16.5430 172.1323 19.9364 155.3121 280.4086 151.6931 0.1057 21.9242 3.8522 36.3358 75.4141 22.5051 74.9710 282.2851 9.9363 15.0255 25.6789 3.3507 6.3105 4.8522 20.6262 0.8881 6.4641 28.9695 7.3797 1.0252 13.9733 10.1265 13.6456
temp: 298.150 k
press: 1.00000 atm
elementType: 17 8 7 7 6 6 6 6 6 6 6 6 6 6 6 6 6 6 6 6 6 6 6 6 6 1 1 1 1 1 1 1 1 1 1 1 1 1 1 1
symmnumber: 1
zpe: 790192.2 jmol-1
zpe.correction: 0.300968 hartree
zpe.thermalcorrener: 0.320347 hartree
zpe.thermalcorrenthalpy: 0.321291 hartree
zpe.thermalcorrgfe: 0.251514 hartree
zpe.sumelectzpe: -1452.348219 hartree
zpe.sumelectthermal: -1452.328840 hartree
zpe.sumelectthermalent: -1452.327896 hartree
zpe.sumelectthermalfe: -1452.397673 hartree
dipole: -6.3014 4.5877 0.0161
dipole: 7.7945
quadrupole: -119.9716 -149.4228 -148.7023
quadrupole: 5.5621 -0.0921 -0.0297
quadrupole: 19.3940 -10.0572 -9.3367 5.5621 -0.0921 -0.0297
hfenergy: -1452.6491871 hartree
pointgroup: C01 [X(C21H15Cl1N2O1)]
dipole: 2.2002006 -2.1361518 0.0068311 debye
polarizability: 423.685389|-5.7577974|298.9296462|0.0505738|-0.1298437|138.6981497 unknown
InChI: InChI=1S/C21H15ClN2O/c1-13(25)23-16-10-11-18-17-4-2-3-5-19(17)21(20(18)12-16)24-15-8-6-14(22)7-9-15/h2-12,23H,1H3
charge 0 multiplicity 1
40 atoms
Cl -6.429819 2.964279 0.001049
O  3.947633 2.813527 -0.006419
N  -0.675273 1.056708 -0.000873
N  4.810129 0.628277 -0.00063
C  1.396486 -1.906818 0.000635
C  1.233669 -0.491013 -0.000103
C  0.057138 -2.534049 0.000837
C  -0.935245 -1.499965 0.000338
C  -0.229343 -0.171214 -0.0002
C  2.317979 0.396399 -0.000578
C  2.692378 -2.454808 0.000926
C  -0.323873 -3.888017 0.001285
C  3.628696 -0.164323 -0.000285
C  -2.30672 -1.819385 0.000176
C  3.800289 -1.579499 0.000448
C  -1.706001 -4.206825 0.00117
C  -2.686838 -3.186042 0.000593
C  -2.044152 1.428745 -0.000451
C  -2.719916 1.675802 1.226697
C  -2.718941 1.680982 -1.227064
C  4.934292 2.024314 -0.001256
C  -4.052821 2.139343 1.229329
C  -4.051909 2.144329 -1.228777
C  -4.703582 2.363247 0.000485
C  6.385095 2.508108 0.001529
H  2.173342 1.477767 -0.001286
H  2.854976 -3.537655 0.001471
H  0.425434 -4.687105 0.001662
H  -3.069991 -1.036955 -0.000248
H  4.815679 -1.997095 0.000639
H  -2.019956 -5.256675 0.001499
H  -3.74887 -3.452992 0.000475
H  5.687816 0.102551 0.000077
H  -2.195669 1.508683 2.172706
H  -2.193911 1.517895 -2.173335
H  -4.57211 2.324374 2.174155
H  -4.570521 2.333161 -2.17322
H  6.912611 2.186533 0.91885
H  6.386472 3.606529 -0.03813
H  6.943251 2.120083 -0.870778
